program: Gaussian 09
title: 000078555
version: EM64L-G09RevD.01
frameworkgroup: C1[X(C10H19NO)]
method: RPBEPBE
basis: SDD
operation: Freq
keyword: #p
keyword: freq=noraman
keyword: PBEPBE/SDD
title: #p freq=noraman PBEPBE/SDD
converged: YES YES NO NO
title: Mulliken charges:
elementType: O N C C C C C C C C C C H H H H H H H H H H H H H H H H H H H
charge: -0.266811 -0.142153 -0.360730 -0.390494 -0.443575 -0.381225 -0.515443 -0.340297 0.189818 -0.343169 -0.356046 -0.695063 0.226825 0.221155 0.210298 0.250147 0.230584 0.227583 0.203718 0.193094 0.250336 0.239846 0.202351 0.197357 0.184444 0.180562 0.199443 0.194055 0.207544 0.209644 0.216204
chargesum: 0.00000
title: Mulliken charges with hydrogens summed into heavy atoms:
elementType: O N C C C C C C C C C C
charge: -0.266811 -0.142153 0.087249 0.069951 0.014591 0.015587 -0.025261 0.059411 0.189818 0.021837 0.037451 -0.061671
polarizability: 1.25807628e+02 6.08485771e+00 1.07077045e+02 -2.97271611e-01 -3.58283696e+00 1.10390174e+02
1716.lowfreq: -11.2817 -7.5783 0.0008 0.0010 0.0012 12.2946 22.0762 29.6176 39.1144
frequency: 20.5620 28.9606 38.8171 84.6328 116.0224 117.2935 139.3366 147.3460 198.5694 227.6216 242.6389 303.0002 335.6303 386.5460 451.4600 516.8959 553.2422 596.3994 631.9622 715.1581 723.6928 754.4163 825.6310 841.8253 868.4855 885.9841 894.0130 927.8386 939.5781 968.6633 1020.1251 1031.4839 1050.4936 1068.8495 1073.2976 1079.2116 1116.1600 1123.0616 1157.1513 1188.1675 1195.3668 1206.5246 1214.2771 1240.4390 1264.5377 1270.9481 1276.1581 1282.8506 1289.1868 1295.9396 1312.9001 1322.7355 1350.5338 1354.2482 1364.7417 1388.6653 1408.9999 1453.3746 1458.3204 1459.4276 1462.2187 1469.7679 1476.9224 1477.1798 1479.3536 1486.9999 1500.9675 1638.2512 2947.8261 2948.8739 2956.5038 2965.1889 2967.8219 2971.3416 2973.5987 2988.7689 3006.3311 3009.9851 3017.4058 3021.0303 3035.3501 3039.9727 3050.7214 3067.6276 3070.5825 3083.1086 3096.9267
redmass: 1.7260 3.6608 3.9521 2.6629 2.8312 1.9163 2.7786 1.9733 2.2673 1.1235 3.8015 2.7430 2.5886 3.4988 3.1575 2.8424 2.7165 3.0460 4.2970 1.5435 1.3336 1.2821 1.4068 1.9651 1.5730 1.9578 1.4584 2.3207 1.9829 1.5553 2.8415 1.9366 2.6403 2.0922 1.9267 2.0631 2.1086 2.2356 1.3072 1.8589 1.4120 1.3351 1.4787 1.4919 1.3523 1.7367 1.4008 1.1002 1.2675 1.2687 1.3314 1.4517 1.5391 1.5405 1.4263 1.2200 2.2485 1.0867 1.0902 1.0822 1.0719 1.0765 1.0934 1.0434 1.0757 1.0872 1.1046 9.8724 1.0673 1.0590 1.0616 1.0607 1.0604 1.0378 1.0604 1.0975 1.0988 1.0647 1.0704 1.1027 1.0885 1.1027 1.0988 1.1007 1.0993 1.0992 1.1023
irintensity: 1.0021 3.3536 0.3699 1.0624 0.6451 0.1006 1.4248 2.3213 3.4579 0.0341 2.0199 6.0337 0.5303 4.6797 2.1841 1.7189 3.3672 1.9376 9.1380 10.1105 3.0393 0.5216 7.6770 14.2158 3.4555 2.8898 0.8919 5.7191 1.1031 5.9770 1.1267 5.7055 0.6264 7.8824 2.7946 0.6191 8.9848 11.5307 4.0147 5.3561 3.1042 25.5897 6.9991 14.0412 15.9308 74.4319 16.1666 10.6171 8.8933 6.9314 0.8452 9.8772 5.8585 1.2768 3.5416 12.8819 59.6610 5.0606 23.2178 1.1020 0.8576 0.6426 14.4225 9.9645 5.0476 19.4773 3.2694 300.8921 55.6308 12.4989 20.4915 23.8064 29.4931 36.1154 133.2308 5.5135 10.3235 20.5070 19.7146 2.7140 34.0245 64.1034 49.3109 98.7813 52.7088 16.5473 36.6973
temp: 298.150 k
press: 1.00000 atm
elementType: 8 7 6 6 6 6 6 6 6 6 6 6 1 1 1 1 1 1 1 1 1 1 1 1 1 1 1 1 1 1 1
symmnumber: 1
zpe: 723806.7 jmol-1
zpe.correction: 0.275683 hartree
zpe.thermalcorrener: 0.289567 hartree
zpe.thermalcorrenthalpy: 0.290511 hartree
zpe.thermalcorrgfe: 0.232550 hartree
zpe.sumelectzpe: -521.478922 hartree
zpe.sumelectthermal: -521.465038 hartree
zpe.sumelectthermalent: -521.464094 hartree
zpe.sumelectthermalfe: -521.522055 hartree
dipole: -0.1385 0.4576 -4.2207
dipole: 4.2477
quadrupole: -72.3463 -71.5150 -83.0752
quadrupole: 1.2914 9.7166 1.3904
quadrupole: 3.2992 4.1305 -7.4297 1.2914 9.7166 1.3904
hfenergy: -521.7546053 hartree
pointgroup: C01 [X(C10H19N1O1)]
dipole: 0.009228 0.099488 -1.6681875 debye
polarizability: 125.8019919|6.1306622|106.056309|0.9075882|2.6831377|111.4165453 unknown
InChI: InChI=1S/C10H19NO/c1-2-3-4-5-8-11-9-6-7-10(11)12/h2-9H2,1H3
charge 0 multiplicity 1
31 atoms
O  1.938008 -0.127556 2.050087
N  1.569834 -0.484438 -0.255554
C  2.034131 0.030548 -1.558036
C  0.746314 -1.693667 -0.12095
C  2.634239 1.422661 -1.202603
C  -0.711835 -1.511573 -0.607319
C  3.028495 1.296946 0.290988
C  -1.492771 -0.44012 0.183736
C  2.128087 0.175392 0.836728
C  -2.962078 -0.300611 -0.272578
C  -3.739332 0.785133 0.506843
C  -5.211132 0.913225 0.05868
H  1.198867 0.106344 -2.277743
H  2.797415 -0.648417 -1.994798
H  1.227721 -2.52488 -0.677295
H  0.756791 -1.951035 0.954746
H  1.860575 2.201172 -1.323497
H  3.483104 1.68229 -1.856236
H  -1.222036 -2.491732 -0.511025
H  -0.724157 -1.2625 -1.688845
H  2.879616 2.221186 0.871894
H  4.08343 0.990194 0.423904
H  -1.460967 -0.69012 1.263653
H  -0.979761 0.537637 0.081909
H  -3.480129 -1.275619 -0.153377
H  -2.993706 -0.063597 -1.357403
H  -3.69909 0.552671 1.59035
H  -3.226313 1.760526 0.381133
H  -5.278049 1.172716 -1.015046
H  -5.754897 -0.038972 0.207019
H  -5.742072 1.697395 0.629234
