program: Gaussian 09
title: 000078547
version: EM64L-G09RevD.01
frameworkgroup: C1[X(C10H10N2O4)]
method: RPBEPBE
basis: SDD
operation: Freq
keyword: #p
keyword: freq=noraman
keyword: PBEPBE/SDD
title: #p freq=noraman PBEPBE/SDD
converged: YES YES NO NO
title: Mulliken charges:
elementType: O O O O N N C C C C C C C C C C H H H H H H H H H H
charge: -0.242443 -0.250535 -0.218495 -0.214940 -0.458485 0.020042 0.499944 -0.622309 0.187642 -0.422190 -0.316324 0.393005 -0.343834 -0.364571 0.288842 -0.759259 0.278757 0.273399 0.368571 0.247134 0.315284 0.287072 0.286267 0.254471 0.266192 0.246766
chargesum: 0.00000
title: Mulliken charges with hydrogens summed into heavy atoms:
elementType: O O O O N N C C C C C C C C C C
charge: -0.242443 -0.250535 -0.218495 -0.214940 -0.089914 0.020042 0.499944 -0.070154 0.187642 -0.175057 -0.001040 0.393005 -0.056762 -0.078304 0.288842 0.008170
polarizability: 2.55788412e+02 -1.26068946e+01 1.42727151e+02 2.31424407e+00 3.55210781e+00 6.40907501e+01
1716.lowfreq: -7.4693 -4.9179 -0.4784 -0.0004 0.0008 0.0010 27.1440 48.5336 60.8876
frequency: 27.1147 48.5319 60.8863 75.7010 81.0718 88.7852 139.1393 158.3161 174.5860 230.6971 269.7458 317.3675 333.5393 383.1348 398.9074 417.0194 447.1576 503.7622 508.3576 551.0804 574.8165 605.1080 625.1481 669.1796 695.6415 741.0535 779.7553 817.6515 832.3138 841.0481 879.4554 881.5706 922.6760 934.2909 979.8110 985.4449 1000.2915 1011.0134 1027.5804 1095.8014 1118.0276 1166.0680 1178.8599 1183.7619 1212.0995 1227.0873 1281.8851 1300.4252 1315.8497 1355.7146 1376.3435 1397.0220 1412.0876 1431.1402 1439.5976 1451.7570 1488.8731 1547.6040 1594.4732 1602.2016 1617.8389 1650.2772 2972.7012 2983.9900 3067.0070 3075.0261 3129.8488 3138.1861 3178.0048 3186.0161 3200.9831 3239.7697
redmass: 4.0318 6.0657 3.7815 6.2609 6.1229 3.9101 1.2215 6.1494 7.1360 8.3087 4.5059 5.2106 5.5097 4.6403 9.7309 3.0156 2.3543 3.2265 7.0474 4.2647 3.9009 5.2790 7.1000 4.7185 6.4869 4.5992 8.1358 1.9007 2.3514 2.0063 1.6600 2.3064 1.4916 2.6083 1.8962 1.3442 3.0275 1.3220 1.8508 3.0495 1.2881 1.9973 1.4310 1.4110 3.5539 4.7189 2.0970 1.5062 1.8517 7.7105 1.2437 6.4022 1.1059 4.4322 1.0804 1.0581 2.6082 2.5377 6.3273 7.0318 6.0422 2.9662 1.0673 1.0393 1.0945 1.0906 1.1004 1.0910 1.0905 1.0948 1.0960 1.0819
irintensity: 0.8208 0.1321 3.2848 6.8756 1.1218 8.3068 0.4898 5.3791 6.7108 3.5771 10.4744 0.3034 0.7027 5.6671 11.9642 0.0167 5.5300 12.8734 2.2245 26.9076 0.3446 8.6841 1.2515 25.7395 10.5052 1.4018 21.3731 4.0348 0.5214 6.5304 30.4448 26.0222 82.0921 24.2568 8.9359 0.4356 0.0434 0.2814 23.7445 24.9878 26.3089 18.4533 228.7539 0.9467 333.4955 277.5816 37.0623 57.5711 66.3949 78.7462 84.8499 143.7288 38.2954 44.7263 25.7071 19.7574 17.8330 735.5192 208.0669 46.4050 92.9424 153.5640 1.8509 0.5580 7.8240 4.3610 7.7570 6.0361 1.5287 2.0919 3.2405 510.6537
temp: 298.150 k
press: 1.00000 atm
elementType: 8 8 8 8 7 7 6 6 6 6 6 6 6 6 6 6 1 1 1 1 1 1 1 1 1 1
symmnumber: 1
zpe: 500248.9 jmol-1
zpe.correction: 0.190535 hartree
zpe.thermalcorrener: 0.205429 hartree
zpe.thermalcorrenthalpy: 0.206373 hartree
zpe.thermalcorrgfe: 0.146518 hartree
zpe.sumelectzpe: -796.240634 hartree
zpe.sumelectthermal: -796.225740 hartree
zpe.sumelectthermalent: -796.224796 hartree
zpe.sumelectthermalfe: -796.284651 hartree
dipole: -9.9312 -1.0194 -0.4609
dipole: 9.9940
quadrupole: -96.8106 -100.4069 -91.4420
quadrupole: 1.6385 -1.1357 -0.3589
quadrupole: -0.5907 -4.1871 4.7779 1.6385 -1.1357 -0.3589
hfenergy: -796.4311687 hartree
pointgroup: C01 [X(C10H10N2O4)]
dipole: 3.87605 0.6188272 -0.2312358 debye
dipolederiv: -0.651051 -0.1769037 -0.0298954 0.4536217 -0.9745383 -0.2147033 0.1923507 -0.1280287 -0.3933798 -1.0018123 0.1024458 -0.0031404 0.0148324 -0.6913061 -0.1455537 -0.0866283 -0.1557928 -0.3638479 -0.85024 0.1993596 0.1189427 0.3684504 -0.6589547 -0.1512425 0.1687567 -0.134922 -0.2936387 -0.8734471 -0.1971018 0.0161409 -0.3995867 -0.6340736 -0.0629965 -0.0329319 -0.0833524 -0.2553419 -2.3420246 0.2997512 0.2626817 0.3231417 -0.5999821 -0.1367158 0.3171376 -0.1022363 -0.3447203 2.2819951 -0.0250839 -0.2336905 0.041492 1.0255057 0.217388 -0.2303795 0.2256593 0.2772018 1.7391168 -0.1390609 -0.1977416 0.1199535 0.136599 -0.0131185 -0.1601535 0.0244391 0.1490069 -0.5211852 -0.2240002 -0.0652583 -0.366522 -0.2517522 -0.1814167 -0.0436609 -0.2396741 -0.1122035 1.7925438 0.0476032 -0.1423877 -0.9980202 1.2699604 0.3417236 -0.5815932 0.238112 0.2948062 -0.5569014 0.1397798 0.072037 0.4198782 -0.0165268 0.0008638 0.1533181 0.031271 -0.1936447 -0.6244686 -0.0583491 0.0289946 -0.3943838 -0.0584875 0.0668633 -0.051191 0.0282123 -0.1406773 -1.1383 0.0460918 0.1371302 -0.0046685 -0.0277225 -0.0176043 0.1352104 -0.0240633 0.0173148 0.422227 -0.0569808 -0.0708752 0.2392228 -0.0017679 -0.0001784 0.0027882 0.0328583 -0.0874425 0.4224701 0.036798 -0.0474848 -0.2242294 0.030495 0.0592921 -0.1197212 0.0294149 -0.0781493 1.1779921 -0.0665429 0.2095061 0.1099455 0.7905932 0.3360953 0.4241137 0.3743671 0.3697167 -0.5800082 -0.0010368 -0.144895 0.0689153 -0.0116994 0.0160401 -0.2817821 -0.0265605 -0.0379755 0.0978233 -0.0126906 0.0192807 -0.0407447 0.0869721 0.0406056 0.0341536 0.024785 0.0210029 -0.0246327 0.0207664 -0.0470241 0.0638052 0.0225234 0.0142064 -0.0636053 0.0453368 0.1220711 0.6544071 0.1284243 0.0516932 0.3979694 0.2550295 -0.012269 0.1626106 -0.0100783 0.2769895 0.0146267 -0.0928147 -0.0068579 -0.0899775 0.0045074 -0.0333877 -0.0048657 -0.0334904 0.1542898 0.150397 0.0422253 0.0170593 0.0141146 0.0806473 -0.0257385 0.0071587 -0.0288875 0.1669611 0.0996385 0.0548072 0.0224247 0.0158268 0.0652018 -0.0301361 0.0131083 -0.0346353 0.1595792 0.09056 -0.0538831 -0.0062734 -0.0237346 0.0639733 -0.0246543 0.0020046 -0.0206797 0.1609868 0.0940082 -0.0180961 0.0076319 -0.0198299 0.034504 0.0951601 -0.0224581 0.0828269 0.0391462 0.0534253 -0.0167429 -0.0122408 -0.0867347 -0.0414812 -0.0568665 -0.0289806 -0.0564976 0.1124589 0.0728401 0.021235 0.044242 -0.0027376 0.1017801 -0.0816565 0.0952401 -0.0583838 -0.0205104 unknown
polarizability: 255.3539014|-4.447096|135.4255485|-16.6562222|21.9201326|71.8268635 unknown
InChI: InChI=1S/C10H10N2O4/c1-7(13)6-10(14)11-8-2-4-9(5-3-8)12(15)16/h2-5,11H,6H2,1H3
charge 0 multiplicity 1
26 atoms
O  1.932982 -1.999584 -0.954989
O  3.419903 1.840967 0.235708
O  -4.906846 1.164162 0.618296
O  -4.951293 -1.042382 0.034562
N  1.337365 0.205484 -0.36821
N  -4.323559 0.066349 0.257724
C  -0.065401 0.108447 -0.225007
C  3.710434 -0.345202 -0.835937
C  2.236501 -0.795842 -0.711153
C  -0.757614 1.290208 0.172521
C  -0.795131 -1.09262 -0.461334
C  -2.857573 0.081696 0.09176
C  -2.150176 1.282507 0.331863
C  -2.191335 -1.100161 -0.302026
C  4.197166 0.887131 -0.068671
C  5.665929 0.921777 0.298355
H  3.89058 -0.14224 -1.914234
H  4.335041 -1.222254 -0.595129
H  1.784193 1.118219 -0.149163
H  -0.19416 2.212312 0.355882
H  -0.258984 -1.994278 -0.760703
H  -2.69842 2.177521 0.636075
H  -2.774321 -2.008173 -0.477175
H  5.854057 0.210129 1.126332
H  5.957552 1.93123 0.625166
H  6.29741 0.597697 -0.548913
