program: Gaussian 09
title: 000078545
version: EM64L-G09RevD.01
frameworkgroup: C1[X(C10H8N2O3)]
method: RPBEPBE
basis: SDD
operation: Freq
keyword: #p
keyword: freq=noraman
keyword: PBEPBE/SDD
title: #p freq=noraman PBEPBE/SDD
converged: NO YES NO NO
title: Mulliken charges:
elementType: O O O N N C C C C C C C C C C H H H H H H H H
charge: -0.291015 -0.218534 -0.221736 -0.105963 0.024435 0.265950 0.166723 0.282349 0.320156 -0.431336 -0.347247 -0.371914 -0.763033 -0.243365 -0.208110 0.292793 0.308069 0.304464 0.261730 0.229292 0.261717 0.241182 0.243391
chargesum: 0.00000
title: Mulliken charges with hydrogens summed into heavy atoms:
elementType: O O O N N C C C C C C C C C C
charge: -0.291015 -0.218534 -0.221736 -0.105963 0.024435 0.265950 0.166723 0.282349 0.320156 -0.138543 -0.039178 -0.067450 -0.010294 -0.002183 0.035281
polarizability: 2.01575477e+02 3.88210378e-01 1.94414685e+02 -2.33644823e-03 -4.06465594e-03 5.49754687e+01
1716.lowfreq: -3.8949 -0.0008 0.0001 0.0007 1.9139 8.9118 33.2129 79.0782 124.8020
frequency: 33.1848 79.0593 124.7980 139.0072 178.1890 220.3277 249.1645 267.1946 339.9763 351.9356 352.3134 407.0297 419.2822 444.7273 498.4896 502.0459 559.9670 615.4980 636.3053 666.0460 690.4117 705.3293 725.3916 761.4617 786.9416 789.3470 898.7739 931.1161 940.9989 974.6016 992.2167 1012.1837 1017.6399 1035.4535 1046.0507 1095.7161 1159.0011 1177.3962 1191.9364 1204.3410 1248.2290 1273.2811 1306.4950 1342.7307 1349.6838 1394.4272 1409.7156 1419.0802 1443.1432 1444.4111 1462.9954 1523.3720 1550.2957 1605.2426 1618.9899 2992.3452 3065.8196 3120.8514 3145.7497 3164.4365 3188.3835 3189.9682 3213.5733
redmass: 13.8744 5.3988 4.0583 3.6600 1.1286 7.0077 4.1212 3.6206 10.2392 6.2673 5.8032 10.8592 3.3991 5.9555 3.3968 7.1447 4.6055 7.1604 5.2102 4.4649 6.4182 8.2651 6.3221 4.3706 5.8894 1.4271 1.4026 1.3234 5.4506 5.2662 1.3468 1.3230 1.7916 1.9498 1.5127 2.4091 1.4136 1.7773 3.4161 1.8952 3.7780 2.2076 5.1834 7.9304 3.2974 4.1841 1.2953 2.6509 2.5182 1.0437 1.2838 4.5082 6.4307 7.1772 6.6144 1.0379 1.0959 1.1002 1.0878 1.0939 1.0959 1.0918 1.0938
irintensity: 0.1137 8.1732 0.9232 0.0332 1.3848 3.6344 0.1820 2.0567 1.9865 1.2469 6.7702 4.3423 2.6504 1.8449 0.0298 7.4327 9.0747 4.6381 6.2258 11.8960 0.2179 9.4454 4.3889 15.3292 3.2139 77.0517 0.0209 14.1872 5.3756 19.2052 5.1214 0.1126 4.4592 13.0738 8.1520 24.4692 19.4598 180.6210 320.8348 27.9617 62.5617 15.0618 52.0669 102.6161 29.2689 6.0005 34.8638 6.9070 17.7318 16.6102 0.2624 42.2513 19.5836 27.5797 5.9975 6.1222 6.5916 10.1381 7.8322 13.2408 6.5443 5.5273 10.5161
temp: 298.150 k
press: 1.00000 atm
elementType: 8 8 8 7 7 6 6 6 6 6 6 6 6 6 6 1 1 1 1 1 1 1 1
symmnumber: 1
zpe: 434807.1 jmol-1
zpe.correction: 0.165609 hartree
zpe.thermalcorrener: 0.177669 hartree
zpe.thermalcorrenthalpy: 0.178613 hartree
zpe.thermalcorrgfe: 0.126809 hartree
zpe.sumelectzpe: -719.867578 hartree
zpe.sumelectthermal: -719.855519 hartree
zpe.sumelectthermalent: -719.854574 hartree
zpe.sumelectthermalfe: -719.906378 hartree
dipole: -3.1401 0.5217 0.0005
dipole: 3.1831
quadrupole: -108.2233 -68.9676 -87.1321
quadrupole: -3.2672 0.0024 -0.0011
quadrupole: -20.1157 19.1401 0.9756 -3.2672 0.0024 -0.0011
hfenergy: -720.0331873 hartree
pointgroup: C01 [X(C10H8N2O3)]
dipole: -1.2472745 -0.1124242 -0.0001993 debye
dipolederiv: -1.0509961 0.2846551 -0.0000098 0.1596562 -0.4191205 0.0000034 -0.0000173 0.0000009 -0.2679204 -0.9620931 -0.2350979 0.0000049 -0.487567 -0.580135 0.00004 -0.0002534 -0.0001258 -0.2369807 -0.6901138 0.1658216 0.0000109 0.425173 -0.7483906 -0.0000874 -0.0001509 0.0001007 -0.2362803 0.9709516 -0.3556817 0.0000461 0.0352617 0.1564171 -0.0000213 0.0000334 -0.0000115 0.1019299 2.2090914 -0.0621785 0.0000444 -0.1293308 1.0213128 0.0000446 0.0003379 0.0000329 0.1823085 0.0162503 -0.1231281 0.0000118 0.2810853 0.1506495 0.000011 0.0000435 -0.0000249 0.0707414 -0.0142731 0.2392616 -0.0000254 0.3357632 -0.1216253 0.0000018 0.0000227 0.0000047 0.025773 -0.9482795 0.1925811 -0.0000494 0.4007319 -0.0237497 0.0000004 -0.0000154 0.0000036 0.0277244 -0.504502 -0.1890906 0.0000007 -0.3892822 0.6060622 -0.0000171 0.0000323 -0.0001717 -0.0224326 0.4047052 0.0226961 -0.0000152 -0.4004228 -0.1581181 -0.000019 0.0000286 0.0000243 -0.0653275 -0.0532241 -0.1202675 -0.000008 -0.1996332 -0.1537356 -0.0000034 -0.0000075 -0.0000108 -0.136882 -0.0439431 0.0454043 -0.0000057 -0.148077 -0.0911524 -0.000004 -0.0000045 0.0000157 -0.137736 0.0537514 0.2633588 0.0000233 0.0683393 -0.1614088 0.0000222 0.0000501 0.0003044 0.0341148 0.1070746 -0.1298783 0.0000002 -0.0747118 0.1927108 0.0000012 -0.0000204 0.0000049 -0.1264971 0.0806205 0.1367502 -0.0000158 0.2077714 -0.0413079 -0.0000056 -0.0000083 -0.0000096 -0.135306 0.1229779 -0.0487532 0.0000089 -0.0170523 0.088136 -0.0000009 -0.0000041 -0.0000165 0.1574039 0.0782569 0.0968761 0.0000047 -0.013098 0.1427278 0.0000008 0.0000163 0.0000074 0.169823 0.0691764 -0.0092232 0.0000059 0.0989135 0.1144396 -0.0000007 -0.0000099 0.0000003 0.1759361 0.0478621 0.0212011 0.0884277 -0.0267235 0.0506501 0.0054215 0.0638154 -0.0407122 -0.006789 -0.0191336 -0.1550436 -0.0001498 -0.0325567 0.0184248 -0.0000654 -0.0001034 -0.0001347 0.1197163 0.0480442 0.0212127 -0.0883209 -0.0265535 0.0505002 -0.0053321 -0.0637976 0.040712 -0.0070585 0.0900363 0.0397602 0.0000016 0.0285943 -0.0958235 0.0000023 -0.0000003 0.0000002 0.1558215 -0.0122405 -0.1012363 0.000009 -0.0962809 0.0025365 0.0000075 0.0000127 0.0000058 0.1579172 unknown
polarizability: 201.4777377|-0.917084|194.5124242|0.0020264|-0.0042278|54.9754687 unknown
InChI: InChI=1S/C10H8N2O3/c1-7-6-10(12(14)15)8-4-2-3-5-9(8)11(7)13/h2-6H,1H3
charge 0 multiplicity 1
23 atoms
O  -2.787074 1.413579 -0.000231
O  3.460249 1.126838 0.000042
O  3.130251 -1.124438 -0.000068
N  -1.505381 1.066048 -0.00018
N  2.678856 0.090763 -0.000306
C  0.236617 -0.729422 -0.000191
C  -1.148377 -0.319655 -0.000148
C  1.225228 0.325526 -0.000246
C  -0.527577 2.053016 -0.00018
C  0.824582 1.67017 -0.000225
C  0.49212 -2.141782 -0.00017
C  -2.211007 -1.260248 -0.000091
C  -1.012428 3.471513 -0.000196
C  -0.561808 -3.061568 -0.00011
C  -1.918488 -2.627083 -0.000068
H  1.594434 2.4444 -0.000243
H  1.527066 -2.481149 -0.000202
H  -3.233731 -0.876565 -0.00007
H  -1.651347 3.665681 0.880755
H  -0.163389 4.171965 0.00057
H  -1.650019 3.666146 -0.882024
H  -0.335136 -4.132821 -0.000101
H  -2.730941 -3.360613 -0.000017
