program: Gaussian 09
title: 000078535
version: EM64L-G09RevD.01
frameworkgroup: C1[X(C4H3NO3)]
method: RPBEPBE
basis: SDD
operation: Freq
keyword: #pfreq=noraman
keyword: PBEPBE/SDD
title: #p freq=noraman PBEPBE/SDD
converged: YES YES YES YES
title: Mulliken charges:
elementType: O O O N C C C C H H H
charge: -0.346843 -0.166804 -0.166801 -0.171730 0.195791 0.195793 -0.237406 -0.237407 0.277062 0.277062 0.381283
chargesum: 0.00000
title: Mulliken charges with hydrogens summed into heavy atoms:
elementType: O O O N C C C C
charge: 0.034440 -0.166804 -0.166801 -0.171730 0.195791 0.195793 0.039656 0.039655
polarizability: 8.53541785e+01 5.76422116e-05 5.99115820e+01 1.82440074e-04 1.59692575e+00 2.63096446e+01
1716.lowfreq: -8.9203 -6.5931 -5.1246 0.0000 0.0003 0.0004 136.1098 182.4088 223.9762
frequency: 136.1098 182.4088 223.9762 271.6479 290.8367 338.6847 555.0220 571.2519 586.3017 662.6534 695.4115 736.0882 806.9748 936.1278 1000.9267 1013.0892 1098.9449 1101.6354 1249.1171 1287.4603 1387.2672 1579.5221 1646.0717 1690.5913 3201.2838 3228.6077 3480.6511
redmass: 11.9174 6.3678 1.1165 9.2982 4.0905 12.2636 4.1949 4.6439 3.2373 8.2774 8.0191 7.0296 1.9833 1.3053 4.4487 2.3502 1.7311 6.5824 2.7455 1.6883 1.5990 6.9148 11.8902 11.6096 1.0897 1.1100 1.0688
irintensity: 9.4209 6.8594 94.8881 16.6483 1.7341 10.1631 0.7380 1.9504 0.9455 36.8376 21.3444 0.9237 83.9835 0.0110 5.9658 68.7421 15.0039 61.1251 5.8644 2.3997 90.4511 3.6156 500.8033 1.5440 0.0066 0.4930 24.4648
temp: 298.150 k
press: 1.00000 atm
elementType: 8 8 8 7 6 6 6 6 1 1 1
symmnumber: 1
zpe: 179192.6 jmol-1
zpe.correction: 0.068251 hartree
zpe.thermalcorrener: 0.075286 hartree
zpe.thermalcorrenthalpy: 0.076230 hartree
zpe.thermalcorrgfe: 0.037028 hartree
zpe.sumelectzpe: -433.997083 hartree
zpe.sumelectthermal: -433.990047 hartree
zpe.sumelectthermalent: -433.989103 hartree
zpe.sumelectthermalfe: -434.028306 hartree
dipole: 0.0001 -2.2164 1.7054
dipole: 2.7966
quadrupole: -59.2220 -35.3674 -43.9140
quadrupole: 0.0000 0.0000 4.5980
quadrupole: -13.0542 10.8004 2.2538 0.0000 0.0000 4.5980
hfenergy: -434.0653337 hartree
pointgroup: C01 [X(C4H3N1O3)]
dipole: 0.0000793 -0.8951215 -0.6398032 debye
dipolederiv: -0.3476133 0.000023 0.0000209 0.0000254 -0.503385 0.0441874 0.0000263 0.0051503 0.1093423 -1.0184755 0.0387881 -0.0303611 -0.2694924 -0.4012941 0.0037061 0.0017318 0.0119578 -0.3175253 -1.0185504 -0.0389666 0.0304427 0.2693176 -0.4012269 0.0036849 -0.0016771 0.0119604 -0.3175267 -1.0597732 -0.0001266 0.0000278 -0.00013 -0.1581707 0.078074 0.000022 0.1373059 -0.2566341 1.5051542 -0.2571267 0.0848878 0.0598413 0.7285773 -0.0810398 0.0454185 -0.0960869 0.2964617 1.5051014 0.2573427 -0.084999 -0.0596295 0.7286507 -0.0810603 -0.0455035 -0.0961231 0.2964793 -0.0271992 -0.1687831 0.0122356 -0.2510232 -0.1656193 0.0133027 0.0343493 0.0015744 -0.1331358 -0.027345 0.1688261 -0.0122495 0.2510692 -0.1655028 0.0132774 -0.0343633 0.0015436 -0.1331353 0.0765283 0.0580968 -0.0011352 0.0354352 0.023634 0.0064096 -0.0041162 0.0150137 0.1851577 0.0765564 -0.0580798 0.0011441 -0.0354197 0.0236059 0.0064132 0.0041262 0.0150186 0.1851579 0.3356163 0.0000061 -0.0000141 0.000006 0.2907308 -0.0069551 -0.000014 -0.0073147 0.0853583 unknown
polarizability: 85.3541779|0.003578|59.7573457|-0.0023165|-2.7765155|26.4638814 unknown
InChI: InChI=1S/C4H3NO3/c6-3-1-2-4(7)5(3)8/h1-2,8H
charge 0 multiplicity 1
11 atoms
O  -0.00032 2.049137 0.038989
O  2.362395 0.277755 -0.049546
O  -2.362517 0.277061 -0.049315
N  -0.000122 0.646852 -0.195314
C  1.186951 -0.144118 -0.066365
C  -1.186955 -0.144473 -0.066229
C  0.681509 -1.563133 0.018525
C  -0.681085 -1.563338 0.01858
H  1.366952 -2.410394 0.056304
H  -1.366271 -2.410804 0.056417
H  -0.000437 2.475355 -0.862446
