program: Gaussian 09
title: 000078553
version: EM64L-G09RevD.01
frameworkgroup: C1[X(C8H9BrS)]
method: RPBEPBE
basis: SDD
operation: Freq
keyword: #p
keyword: freq=noraman
keyword: PBEPBE/SDD
title: #p freq=noraman PBEPBE/SDD
converged: YES YES NO NO
title: Mulliken charges:
elementType: Br S C C C C C C C C H H H H H H H H H
charge: -0.038522 0.207132 -0.156973 -0.630716 -0.185244 -0.261909 -0.596896 -0.232592 -0.206398 -0.237149 0.273084 0.287300 0.231936 0.249769 0.295013 0.304202 0.232077 0.232221 0.233664
chargesum: 0.00000
title: Mulliken charges with hydrogens summed into heavy atoms:
elementType: Br S C C C C C C C C
charge: -0.038522 0.207132 -0.156973 -0.070332 0.046691 -0.012140 0.002320 -0.000515 0.025824 -0.003486
polarizability: 1.71917698e+02 -5.72620220e+00 1.12235418e+02 -2.05756579e+01 -9.84036855e+00 7.40633481e+01
1716.lowfreq: -25.6008 -6.3649 -5.8766 -0.0017 0.0012 0.0018 8.6785 35.0960 88.7885
frequency: -25.2348 34.9662 88.7657 164.9928 174.1254 194.9344 230.5034 329.9682 390.0100 401.0475 474.7264 570.4290 610.4908 663.2303 675.6611 691.6420 746.3938 753.5619 839.6933 907.0798 936.1720 970.4376 984.6709 992.7766 1017.5086 1058.6746 1071.0965 1077.0946 1102.3118 1173.4149 1189.3003 1209.5484 1258.6481 1267.6586 1309.2684 1374.4619 1427.0339 1450.0919 1454.4200 1464.5965 1586.3656 1590.3357 3051.8913 3070.0357 3119.5637 3129.1234 3135.0109 3147.0875 3155.0154 3161.7694 3169.8831
redmass: 4.0874 7.8256 2.3997 4.6287 4.7657 3.9302 5.9349 5.4709 6.3187 3.1121 3.3550 6.6431 6.4195 5.5172 6.7386 2.2174 1.4470 1.1701 1.2521 1.3662 1.3625 1.3938 6.1205 1.3148 3.3780 4.5863 2.4337 1.4942 1.1187 1.0508 1.1179 1.1313 1.1905 1.1875 1.3180 8.2215 2.1270 1.1080 1.1814 1.7796 6.1699 5.9596 1.0589 1.0560 1.1068 1.0846 1.0876 1.0921 1.0967 1.1119 1.1017
irintensity: 0.3665 0.3720 1.2000 0.9739 8.5080 0.3272 1.0767 2.3636 0.6995 0.9629 16.1825 80.6819 0.2686 2.7758 13.4936 33.3897 75.4901 16.3688 0.1911 2.0234 0.0639 0.1591 3.4270 0.1333 19.3781 8.0851 11.6563 10.7908 1.7710 0.1292 0.7135 24.3209 3.0200 6.4334 2.3558 0.4896 8.7237 14.0700 23.2519 29.3378 2.3282 36.5425 7.9163 8.2387 2.3590 2.6088 0.8919 11.2881 30.6559 3.9901 19.0403
temp: 298.150 k
press: 1.00000 atm
elementType: 35 16 6 6 6 6 6 6 6 6 1 1 1 1 1 1 1 1 1
symmnumber: 1
zpe: 383089.1 jmol-1
zpe.correction: 0.145911 hartree
zpe.thermalcorrener: 0.155369 hartree
zpe.thermalcorrenthalpy: 0.156314 hartree
zpe.thermalcorrgfe: 0.108753 hartree
zpe.sumelectzpe: -721.028841 hartree
zpe.sumelectthermal: -721.019382 hartree
zpe.sumelectthermalent: -721.018438 hartree
zpe.sumelectthermalfe: -721.065999 hartree
dipole: 1.9567 -0.4137 -0.1589
dipole: 2.0062
quadrupole: -77.5997 -75.6248 -75.4674
quadrupole: -6.7054 -4.9553 -3.5744
quadrupole: -1.3691 0.6059 0.7632 -6.7054 -4.9553 -3.5744
hfenergy: -721.1747517 hartree
pointgroup: C01 [X(C8H9Br1S1)]
dipole: -0.7841376 -0.0869038 0.0243452 debye
dipolederiv: -0.529734 -0.3044121 0.0797267 -0.4549904 -0.4872222 0.1119002 0.0195798 0.0178797 -0.1685763 -0.5132381 -0.0336204 0.029256 0.0143016 -0.1397103 0.0836852 0.0029979 0.1695523 -0.1558412 0.8383282 -0.2390726 -0.0202388 -0.475327 -0.0372822 0.0459411 0.0303875 -0.0120245 -0.0195633 0.1630375 0.073357 -0.0002485 0.1427667 0.0527345 0.0095303 -0.0025568 -0.1271475 0.0882932 -0.2474706 0.0901092 0.0841124 0.2321654 -0.1486717 0.0251528 0.053987 0.0436681 -0.0751504 -0.40989 0.0252219 0.0016482 0.0742915 0.0024998 0.0966517 0.0156656 0.0892825 -0.0633037 0.5443228 0.4336275 -0.0431954 0.6192907 0.5791807 -0.0614853 -0.1052747 -0.0079328 0.080381 0.0384375 -0.0450532 0.0316728 -0.0493272 0.0436296 0.1263721 0.0348166 0.1150103 -0.0355556 0.1182338 0.0078282 0.0965722 -0.0493981 -0.0101648 0.0887426 0.0653274 0.0907274 -0.0316623 -0.0218245 -0.0977024 0.0140266 -0.0347027 -0.0864405 0.0247781 0.0265584 0.0237578 -0.151309 0.0727996 -0.0188879 0.0425608 -0.0640191 -0.0055046 -0.0957579 0.0538369 -0.0333692 -0.0459437 -0.045926 0.0671911 -0.0404752 0.0070741 0.0383381 0.0277806 0.0220581 0.0248475 0.0932349 -0.0036556 -0.0435069 -0.1100236 -0.0386667 0.0812676 -0.0442119 -0.108619 -0.0544483 0.07697 0.1122495 0.0572703 0.0096294 0.0267631 0.0138196 -0.1055918 0.0088837 -0.0896815 0.0743693 0.0107335 -0.0781833 -0.0002302 -0.0351766 -0.0189272 -0.0967006 0.0334883 -0.0279064 -0.0112671 -0.0620089 0.0236434 -0.0581923 -0.0361727 -0.0090793 -0.001556 -0.0365423 0.0002103 0.0785077 0.0635218 0.0291916 -0.0048396 0.0514044 -0.0211577 -0.1267563 0.0148747 -0.12177 0.0635831 -0.0496908 -0.0415274 -0.0977976 -0.0368433 0.0850529 -0.0723578 -0.1133727 -0.069862 0.0667573 -0.0782259 0.0945259 -0.0139638 0.1065663 0.0676377 -0.0361171 -0.0160965 -0.0307936 0.1360762 unknown
polarizability: 171.9458628|14.7363466|114.1562707|5.6411202|14.9724481|72.11433 unknown
InChI: InChI=1S/C8H9BrS/c9-6-7-10-8-4-2-1-3-5-8/h1-5H,6-7H2
charge 0 multiplicity 1
19 atoms
Br 4.000832 1.86963 -0.53613
S  1.13569 -1.767161 0.176413
C  -0.427083 -0.782847 0.208727
C  2.471276 -0.439176 0.423714
C  -0.603833 0.366045 1.01506
C  -1.500069 -1.268019 -0.578801
C  2.552679 0.449341 -0.809571
C  -1.850593 1.032722 1.022654
C  -2.748479 -0.606588 -0.550583
C  -2.927669 0.549275 0.24443
H  2.260499 0.131891 1.340648
H  3.397796 -1.015381 0.576322
H  0.209515 0.743393 1.643881
H  -1.356702 -2.149573 -1.213012
H  2.858444 -0.1016 -1.710321
H  1.630047 1.019936 -0.99045
H  -1.978244 1.925449 1.644777
H  -3.574094 -0.988947 -1.160792
H  -3.893015 1.066309 0.256634
