program: Gaussian 09
title: 000078554
version: EM64L-G09RevD.01
frameworkgroup: C1[X(C8H9NO3)]
method: RPBEPBE
basis: SDD
operation: Freq
keyword: #pfreq=noraman
keyword: PBEPBE/SDD
title: #p freq=noraman PBEPBE/SDD
converged: YES YES NO NO
title: Mulliken charges:
elementType: O O O N C C C C C C C C H H H H H H H H H
charge: -0.277235 -0.208222 -0.198627 0.010506 0.199793 0.250543 0.264652 -0.768699 -0.369948 -0.381382 -0.208504 -0.534343 0.256193 0.256922 0.239243 0.248980 0.282378 0.237000 0.225031 0.224864 0.250855
chargesum: 0.00000
title: Mulliken charges with hydrogens summed into heavy atoms:
elementType: O O O N C C C C C C C C
charge: -0.277235 -0.208222 -0.198627 0.010506 0.199793 0.250543 0.264652 -0.016341 -0.120968 -0.099004 0.028497 0.166407
polarizability: 1.48109474e+02 -1.13107987e+00 1.23014100e+02 -1.61368694e+00 2.34380386e+00 5.30236239e+01
1716.lowfreq: -9.2047 -3.1217 0.0004 0.0007 0.0008 8.6836 44.0842 70.1834 121.3434
frequency: 44.0576 70.1703 121.3422 169.1700 182.1764 195.3547 245.8965 273.8330 289.8585 341.4866 364.6447 412.2399 484.2359 498.6867 534.5652 585.2926 612.8049 692.6795 711.3977 724.9541 797.8382 802.8271 838.9614 895.2828 973.7643 994.2483 1036.3383 1040.4738 1084.2654 1113.0441 1152.3762 1159.6947 1194.8913 1211.3910 1214.9609 1241.5113 1361.1276 1379.4993 1402.6578 1424.4869 1441.5172 1461.2578 1466.8327 1469.1386 1470.7757 1481.2350 1587.6428 1598.9961 2963.7355 3005.7195 3054.0095 3082.9101 3129.3131 3130.0811 3150.4873 3172.2528 3194.3158
redmass: 8.1254 3.4714 3.4895 1.1400 2.6274 5.0753 1.5670 3.8508 2.4268 5.0473 4.0477 6.7531 4.1489 5.7536 4.0591 4.7257 6.5035 4.3366 2.6989 8.0083 2.3030 3.1451 5.2411 1.4102 1.3249 2.8059 1.6740 2.2469 2.0658 1.2593 1.3643 2.1648 1.7130 2.1479 11.5826 2.4784 6.4889 5.8856 1.2362 1.8146 1.4127 1.2054 1.3150 1.0925 1.0869 1.6664 6.4248 7.3238 1.0329 1.0383 1.1042 1.0954 1.0999 1.0996 1.0875 1.0938 1.0961
irintensity: 0.2521 0.2369 9.7063 2.2586 0.2778 0.5511 0.4037 5.1307 0.3231 1.1711 1.2578 1.1144 1.8687 4.2365 1.1953 3.6609 2.7774 0.9339 33.1513 29.8596 38.9660 21.1821 14.1279 0.5283 1.8385 25.6009 4.9365 24.8026 14.5091 0.0677 2.1801 14.3679 5.9366 62.8509 330.7268 71.2957 68.6556 85.9160 17.3189 10.9439 9.2068 9.1652 84.4670 25.6482 43.8740 22.3323 5.2663 21.3168 59.0925 5.6525 42.9926 9.9646 15.0014 13.0116 7.4723 9.2320 4.8183
temp: 298.150 k
press: 1.00000 atm
elementType: 8 8 8 7 6 6 6 6 6 6 6 6 1 1 1 1 1 1 1 1 1
symmnumber: 1
zpe: 417106.2 jmol-1
zpe.correction: 0.158867 hartree
zpe.thermalcorrener: 0.170151 hartree
zpe.thermalcorrenthalpy: 0.171096 hartree
zpe.thermalcorrgfe: 0.121386 hartree
zpe.sumelectzpe: -589.687660 hartree
zpe.sumelectthermal: -589.676376 hartree
zpe.sumelectthermalent: -589.675432 hartree
zpe.sumelectthermalfe: -589.725141 hartree
dipole: 6.4877 1.9365 -0.0536
dipole: 6.7708
quadrupole: -71.1845 -65.8538 -71.5511
quadrupole: 0.1790 0.5694 -1.9144
quadrupole: -1.6547 3.6760 -2.0213 0.1790 0.5694 -1.9144
hfenergy: -589.8465274 hartree
pointgroup: C01 [X(C8H9N1O3)]
dipole: -2.5426696 -0.6448819 -0.4635879 debye
dipolederiv: -1.4755821 0.3880991 -0.1301637 0.5877881 -0.4993818 0.0595641 -0.115433 0.0370984 -0.3016829 -0.7906542 0.1727375 -0.1901887 0.1393754 -0.5427875 0.1402757 -0.1612755 0.1394761 -0.3135946 -0.5667635 -0.1855928 -0.0335581 -0.1758456 -0.7207059 0.1210512 -0.0825974 0.1021869 -0.2626873 1.5618692 0.1009154 0.330024 0.2026405 1.0510471 -0.2890954 0.3401278 -0.2455696 0.3370691 -0.1344422 0.3968298 0.0267326 -0.1745149 0.2933711 0.0152598 0.0193445 0.0945532 -0.0094106 0.9901601 -0.6777618 0.0601787 -0.8812818 0.1932555 -0.1189519 0.0380857 -0.0899075 0.0846523 -0.4592519 -0.1586832 -0.1143525 -0.2399692 0.0892771 0.0255061 -0.1106574 0.0006416 0.0042694 0.0752295 -0.1266437 -0.0237416 0.0247154 -0.2223633 -0.0135404 0.0018911 0.0019565 0.0500878 -0.0266397 -0.0660435 0.0178322 0.2692456 -0.0682564 0.0465372 0.0541465 0.0066408 -0.1662235 -0.0464192 -0.0954173 0.0136133 0.2610849 -0.188942 0.0379635 -0.0155765 -0.0410346 -0.1437209 -0.0757875 0.1566311 0.0239862 -0.032136 0.1389111 0.030561 0.0029215 0.0530963 -0.1338136 0.8674871 -0.0738996 0.0725518 0.1812735 0.1975425 0.0120512 0.1000885 -0.0297536 0.3326367 0.0796915 -0.036257 0.0683643 -0.01991 0.0350685 0.0330793 0.0584639 0.0511875 -0.010039 -0.0174378 0.1256097 0.0448409 0.0546112 0.0726924 -0.0112904 0.0280757 -0.0273204 0.1056117 0.0175339 -0.012888 -0.1046266 -0.000139 0.0709448 -0.0062861 -0.0823866 -0.0372567 -0.0161101 -0.0610037 -0.0577473 -0.0429892 -0.0558895 0.0925251 -0.0185925 -0.0419595 -0.0165572 0.1534534 0.060864 0.0614725 -0.0082465 0.0285248 0.0844709 -0.0141243 -0.0024712 0.0157029 0.1775335 0.0718321 -0.0246449 -0.0165886 -0.0253526 -0.088714 -0.0345622 -0.0091427 -0.0358608 0.1520952 -0.0315454 0.0054731 0.0035354 -0.1655442 -0.0027392 0.1060854 0.0429239 0.1010836 -0.0500763 -0.0176308 0.0266619 0.0141327 -0.1207647 0.0461167 -0.1227131 -0.0617916 -0.0720796 -0.1139153 -0.0215093 0.081149 -0.0113366 0.1420883 -0.0313327 0.0012218 -0.0027777 -0.0082835 0.1238648 unknown
polarizability: 145.3096869|-2.712344|123.1496527|15.6959755|2.216152|55.6878578 unknown
InChI: InChI=1S/C8H9NO3/c1-6-7(9(10)11)4-3-5-8(6)12-2/h3-5H,1-2H3
charge 0 multiplicity 1
21 atoms
O  -2.364245 1.1050 -0.293263
O  3.264998 -0.652561 0.804315
O  2.766034 1.443453 0.074872
N  2.434174 0.223621 0.340536
C  -0.026825 0.72064 0.024671
C  -1.322006 0.168422 -0.244559
C  1.037615 -0.218804 0.0830
C  0.107597 2.212282 0.251363
C  -1.51999 -1.218645 -0.443356
C  0.863616 -1.614131 -0.097422
C  -0.421732 -2.104729 -0.368014
C  -3.722957 0.614861 -0.54035
H  0.560875 2.702786 -0.628235
H  -0.883884 2.653132 0.428386
H  0.773966 2.437253 1.100466
H  -2.517152 -1.614829 -0.653917
H  1.73211 -2.27161 -0.022196
H  -0.577135 -3.176887 -0.523149
H  -4.047095 -0.088543 0.250815
H  -3.80035 0.12663 -1.530961
H  -4.356114 1.513558 -0.5204
