program: Gaussian 09
title: 000078543
version: EM64L-G09RevD.01
frameworkgroup: C1[X(C10H13Cl)]
method: RPBEPBE
basis: SDD
operation: Freq
keyword: #p
keyword: freq=noraman
keyword: PBEPBE/SDD
title: #p freq=noraman PBEPBE/SDD
converged: YES YES NO NO
title: Mulliken charges:
elementType: Cl C C C C C C C C C C H H H H H H H H H H H H H
charge: -0.087734 -0.351780 -0.553151 -0.331034 0.503899 -0.591758 -0.401359 -0.424435 -0.229506 -0.225277 -0.243608 0.205164 0.232934 0.200040 0.206307 0.227968 0.204241 0.266074 0.257264 0.232699 0.229517 0.223596 0.222852 0.227088
chargesum: 0.00000
title: Mulliken charges with hydrogens summed into heavy atoms:
elementType: Cl C C C C C C C C C C
charge: -0.087734 0.086318 -0.146804 0.101175 0.503899 -0.068420 -0.168660 -0.194918 -0.005910 -0.002425 -0.016521
polarizability: 1.35677584e+02 -7.45234170e+00 1.16911243e+02 1.62196897e+01 9.48956327e+00 7.92004997e+01
1716.lowfreq: -7.5241 0.0018 0.0022 0.0030 5.4338 10.9380 14.7903 38.5783 61.4832
frequency: 12.4923 38.4348 61.4564 88.0393 133.5332 207.0897 248.4855 296.6246 333.0121 403.4708 422.2981 515.5449 575.5257 597.8733 618.0024 705.6321 748.7665 759.7808 806.3640 824.1561 853.4347 872.1244 919.0982 975.3507 988.8391 992.3191 993.3774 1025.4356 1032.4265 1034.9309 1069.7284 1098.7672 1123.8510 1171.5019 1179.2888 1186.3954 1216.0216 1248.8582 1269.9440 1283.4310 1301.8049 1326.2458 1331.6342 1363.2906 1382.6915 1440.1070 1445.9941 1450.6751 1468.9042 1484.1029 1484.7839 1593.2736 1614.8501 2955.3242 2970.9658 2983.9890 3019.4742 3025.7391 3048.8200 3060.3381 3113.6425 3114.8950 3130.0013 3131.2019 3142.7642 3161.8363
redmass: 4.0551 5.3703 4.0225 2.6229 2.9287 2.6072 3.6303 3.2331 2.4047 2.8170 3.1424 2.9760 4.6706 4.3416 6.3556 1.7589 1.2083 1.7286 4.0421 1.4578 1.2525 1.4999 1.4491 1.3885 4.0153 2.9157 1.3122 2.3291 1.9748 2.2083 1.5648 1.8437 1.2472 1.0532 1.3271 1.1141 2.3780 1.3161 1.3397 1.1527 1.1304 1.2771 1.3704 1.5726 7.8021 2.1751 1.0793 1.1007 1.1027 2.2838 1.1006 6.0415 6.1954 1.0640 1.0594 1.0628 1.0945 1.0969 1.0614 1.1009 1.0870 1.0869 1.1112 1.0907 1.0958 1.1015
irintensity: 0.3677 1.4222 1.6252 0.6422 0.8829 0.4589 0.6328 3.0576 0.4263 0.0035 4.2247 10.7962 2.8562 24.7605 0.0590 52.0546 22.2058 37.0409 1.1795 6.5067 0.0733 4.6920 2.9135 0.0869 3.2258 7.2889 0.1033 2.9153 3.4196 4.6341 10.9541 3.8818 3.3067 0.1501 10.6139 0.3509 0.0882 3.9251 1.8705 4.2993 23.2085 0.3316 1.1645 0.6763 0.0559 6.5337 7.1587 6.9169 0.4052 18.9565 15.0277 1.4206 9.8686 21.9443 21.9880 41.5119 14.0336 5.0584 20.7838 59.2555 9.4402 8.0544 21.4067 10.6484 47.0275 23.1014
temp: 298.150 k
press: 1.00000 atm
elementType: 17 6 6 6 6 6 6 6 6 6 6 1 1 1 1 1 1 1 1 1 1 1 1 1
symmnumber: 1
zpe: 529222.3 jmol-1
zpe.correction: 0.201570 hartree
zpe.thermalcorrener: 0.212700 hartree
zpe.thermalcorrenthalpy: 0.213644 hartree
zpe.thermalcorrgfe: 0.161334 hartree
zpe.sumelectzpe: -848.098700 hartree
zpe.sumelectthermal: -848.087571 hartree
zpe.sumelectthermalent: -848.086627 hartree
zpe.sumelectthermalfe: -848.138937 hartree
dipole: -0.3868 -2.3544 0.1041
dipole: 2.3882
quadrupole: -76.0142 -69.4829 -74.0234
quadrupole: -9.9970 3.5441 3.4409
quadrupole: -2.8407 3.6906 -0.8499 -9.9970 3.5441 3.4409
hfenergy: -848.3002703 hartree
pointgroup: C01 [X(C10H13Cl1)]
dipole: 0.069175 0.929201 0.1210622 debye
dipolederiv: -0.2780465 -0.0694893 -0.0282468 -0.1736903 -0.5555993 -0.08978 -0.0438628 -0.0389194 -0.2128436 0.0072316 0.0221435 -0.0108277 0.0599818 0.066866 -0.0649725 0.0970876 -0.0936725 0.0612614 -0.1331076 0.0141905 0.0082885 -0.0444832 0.1808732 -0.0042237 -0.0800367 0.0074504 0.1496993 -0.0432773 0.0000264 -0.0397447 -0.1522383 0.0028467 -0.0615893 -0.1607097 -0.0304588 0.0576722 0.3459535 -0.0806945 -0.1014624 -0.1137194 -0.0344956 0.0106137 -0.1430877 0.0067517 -0.0328962 0.1875731 0.128315 0.0279295 0.2394177 0.7310334 0.0755573 0.098644 0.083521 0.2211926 -0.1465059 0.0493618 -0.0603921 0.1236951 -0.0208668 -0.098341 -0.0568177 -0.0663423 -0.0986732 -0.1870408 -0.0339347 -0.0141011 -0.0646528 0.0604595 -0.042507 0.0271574 -0.0714246 -0.1419493 -0.0264097 -0.0515632 -0.0390468 -0.0764648 0.0993356 -0.0600915 -0.0350119 -0.0627615 -0.1027652 0.0002876 0.0309309 -0.084993 0.0506617 0.036532 -0.0850871 -0.0905965 -0.0797251 -0.0701913 0.0064425 -0.0572944 -0.0903369 -0.0489463 -0.0910466 -0.0035217 -0.078411 -0.0026311 -0.1314025 0.0356826 -0.0137106 0.0214144 0.0002287 0.0391919 0.0856529 0.023081 0.0584305 -0.1355271 0.0845921 0.0202965 -0.0070459 0.0401486 -0.1002455 -0.0385152 0.0150885 -0.0080861 0.0629592 0.0250748 0.0106034 0.0095432 0.0350434 -0.1645478 -0.0665055 -0.0015618 0.0024533 0.0588861 0.016444 0.0066568 0.0506201 -0.0135372 0.0337698 0.1018367 0.054084 0.0376641 -0.1258192 0.0326998 -0.0080192 0.0006615 0.0036518 0.0777334 0.0951929 0.0495247 0.0455574 -0.124459 0.0289654 -0.0626204 -0.0253474 0.0520152 -0.1663473 -0.0385384 -0.0198423 -0.0444167 0.0812247 -0.1500365 0.0374019 0.0306854 0.0204621 -0.0494359 -0.0273305 0.0433302 -0.0400021 0.0788284 0.0995851 -0.0404492 0.042419 -0.0354611 -0.0559431 0.0506294 -0.0210389 0.0418031 -0.0981245 0.0300408 -0.0769448 0.0968965 -0.0707705 0.0179495 0.0721935 0.0923748 0.0777804 0.0652432 0.0740585 0.1003657 0.0109929 0.0833495 -0.0871661 0.0439978 0.0130645 0.0335555 0.1195839 0.0609675 0.0758702 0.0144079 0.0948828 -0.0953339 0.0526043 0.0144815 0.0548974 0.1275319 0.0141782 -0.0669674 0.0900631 -0.0780637 -0.0018764 0.0939854 0.1014998 0.090175 0.0762913 -0.0853528 0.0655252 0.0976228 0.0684893 0.0763133 -0.0012603 0.1015588 -0.0015995 0.1142768 unknown
polarizability: 136.7678854|-4.3485411|117.3315929|-15.897964|-7.5999967|77.6898482 unknown
InChI: InChI=1S/C10H13Cl/c11-9-5-4-8-10-6-2-1-3-7-10/h1-3,6-7H,4-5,8-9H2
charge 0 multiplicity 1
24 atoms
Cl -4.286959 -1.619532 -0.45763
C  -1.564916 0.275633 -0.002836
C  -0.425363 0.740151 0.945646
C  -2.958247 0.689695 0.515827
C  0.952368 0.331779 0.443768
C  -4.119069 0.272936 -0.386036
C  1.446374 -0.978916 0.673974
C  1.756956 1.233663 -0.298962
C  2.70664 -1.3784 0.176122
C  3.018818 0.839329 -0.800266
C  3.498364 -0.46967 -0.564669
H  -1.397453 0.702302 -1.012386
H  -1.526659 -0.824339 -0.114722
H  -0.476668 1.841457 1.057102
H  -0.607978 0.307571 1.949678
H  -3.120538 0.285468 1.534083
H  -3.002232 1.79744 0.606572
H  -5.093347 0.620397 -0.010252
H  -3.976144 0.582263 -1.433363
H  0.839944 -1.688592 1.251229
H  1.393464 2.253033 -0.481555
H  3.072797 -2.393625 0.367599
H  3.627596 1.551777 -1.36891
H  4.477253 -0.776818 -0.949709
