program: Gaussian 09
title: 000078576
version: EM64L-G09RevD.01
frameworkgroup: C1[X(C11H15N3)]
method: RPBEPBE
basis: SDD
operation: Freq
keyword: #pfreq=noraman
keyword: PBEPBE/SDD
title: #p freq=noraman PBEPBE/SDD
converged: YES YES NO NO
title: Mulliken charges:
elementType: N N N C C C C C C C C C C C H H H H H H H H H H H H H H H
charge: -0.471388 -0.439220 -0.116733 0.152176 -0.393364 0.221336 -0.467123 0.329770 0.373110 -0.422698 -0.419185 -0.849775 -0.832283 -0.240334 0.229414 0.217377 0.219210 0.227609 0.302062 0.283217 0.228231 0.228225 0.248480 0.216544 0.237647 0.215377 0.286771 0.213192 0.222353
chargesum: 0.00000
title: Mulliken charges with hydrogens summed into heavy atoms:
elementType: N N N C C C C C C C C C C C
charge: -0.169326 -0.156003 -0.116733 0.152176 0.053427 0.221336 -0.020304 0.329770 0.373110 -0.194466 -0.190960 -0.147104 -0.116943 -0.017981
polarizability: 1.87546628e+02 4.14407305e-01 1.40541259e+02 -8.26149035e+00 -4.15359622e+00 9.15180404e+01
1716.lowfreq: -10.9514 -0.0009 -0.0006 -0.0004 4.0683 9.1395 53.3729 59.9814 77.6759
frequency: 53.3221 59.8899 77.6681 90.7914 148.4645 181.6850 190.1345 219.7554 230.3121 265.5403 277.5028 320.6589 353.1648 410.4372 461.7646 497.2861 513.2604 523.8236 541.9336 559.1347 629.3610 697.3407 722.4747 743.8255 771.4922 777.9401 824.8734 838.8471 896.0046 896.7363 920.2949 938.7476 967.4395 987.1276 1020.2560 1040.2455 1045.6266 1053.7412 1060.2922 1085.9288 1100.0447 1174.0773 1175.1188 1206.6654 1211.0387 1247.0303 1261.7620 1275.8311 1284.5815 1309.6427 1368.7100 1392.3130 1396.4552 1403.0597 1438.2443 1451.7686 1455.8921 1473.5582 1479.9731 1485.1809 1488.3502 1499.9154 1517.5849 1604.7390 1607.9291 1635.2768 2951.0524 2967.0930 2975.9054 2997.1828 3027.0091 3030.7717 3046.2486 3053.4823 3083.8641 3086.1527 3118.0333 3127.4110 3154.9018 3525.9092 3533.6465
redmass: 3.9702 3.4228 3.2575 2.1630 3.4425 1.1009 1.0635 3.2265 2.7673 3.4401 3.8420 2.8483 3.7038 1.3608 2.6209 2.2929 3.1175 2.5955 3.9220 3.1795 6.2136 4.8806 4.2269 5.4449 1.6292 2.3979 1.2393 4.3159 2.1546 1.9283 2.6584 3.6501 1.3350 1.6128 2.5047 1.6473 2.0984 1.6160 3.5997 1.7591 1.6786 1.1750 1.1658 1.3773 1.8745 2.0305 1.8314 1.4015 2.1168 1.3700 4.0748 1.2812 1.3349 1.6699 2.0074 1.1248 1.8725 1.0826 1.1000 1.3065 1.2809 1.1952 1.7942 5.8519 5.8313 5.9397 1.0439 1.0365 1.0610 1.0607 1.1044 1.0909 1.0969 1.1062 1.0993 1.0971 1.0856 1.0917 1.0994 1.0746 1.0777
irintensity: 1.0862 3.4990 0.4418 3.4764 2.5604 2.0138 1.3063 5.8894 5.9564 2.7552 5.4252 2.2347 4.9430 172.5041 12.2114 41.2714 1.5465 43.4733 10.3320 23.8623 15.7300 12.2023 15.8234 7.8529 41.3413 17.5884 0.3595 1.5869 3.7792 1.1163 11.0085 9.2420 0.1917 9.9610 17.2354 9.5660 3.1437 5.9224 61.2399 5.1350 9.3187 5.1007 2.1801 4.1103 5.0345 23.1481 3.4745 51.0381 21.3565 30.7334 11.2053 24.8507 11.4851 44.2271 3.1944 27.0990 25.5639 11.6200 5.4187 89.6053 53.6802 36.1531 278.0993 38.5059 3.6734 251.7830 40.4257 28.7546 58.8930 116.3056 11.0503 21.0555 14.3895 69.7515 21.2111 20.5743 0.9386 29.2612 35.5873 15.3536 8.8330
temp: 298.150 k
press: 1.00000 atm
elementType: 7 7 7 6 6 6 6 6 6 6 6 6 6 6 1 1 1 1 1 1 1 1 1 1 1 1 1 1 1
symmnumber: 1
zpe: 637122.3 jmol-1
zpe.correction: 0.242667 hartree
zpe.thermalcorrener: 0.256260 hartree
zpe.thermalcorrenthalpy: 0.257205 hartree
zpe.thermalcorrgfe: 0.202425 hartree
zpe.sumelectzpe: -591.377828 hartree
zpe.sumelectthermal: -591.364235 hartree
zpe.sumelectthermalent: -591.363290 hartree
zpe.sumelectthermalfe: -591.418070 hartree
dipole: 1.9650 1.6530 -2.4662
dipole: 3.5603
quadrupole: -71.2764 -78.0901 -85.3506
quadrupole: -0.8822 -5.0694 -0.7719
quadrupole: 6.9627 0.1489 -7.1116 -0.8822 -5.0694 -0.7719
hfenergy: -591.6204951 hartree
pointgroup: C01 [X(C11H15N3)]
dipole: -0.819255 0.2303473 1.1125797 debye
polarizability: 186.2819726|8.748997|135.3097686|-9.4441247|16.194553|98.014186 unknown
InChI: InChI=1S/C11H15N3/c1-8-4-3-5-9(2)10(8)14-11-12-6-7-13-11/h3-5,12,14H,6-7H2,1-2H3
charge 0 multiplicity 1
29 atoms
N  -0.525863 0.37765 0.847652
N  -2.913829 0.243666 0.92472
N  -1.837509 -0.451858 -1.021931
C  0.805457 0.201932 0.343712
C  -4.039144 -0.271434 0.101079
C  -1.711126 0.022877 0.200182
C  -3.303791 -0.668754 -1.240303
C  1.656192 1.349964 0.311492
C  1.288313 -1.083717 -0.042136
C  2.992126 1.198492 -0.12542
C  2.627178 -1.183899 -0.495678
C  1.133166 2.716328 0.72378
C  0.423322 -2.322025 0.044687
C  3.478605 -0.060202 -0.540137
H  -4.806267 0.506054 -0.061446
H  -4.522985 -1.144474 0.581737
H  -3.496343 -1.720421 -1.522849
H  -3.639388 -0.032386 -2.079616
H  -0.637847 1.114929 1.54683
H  -2.929311 0.112154 1.938565
H  3.646787 2.077683 -0.154719
H  3.004902 -2.167121 -0.800648
H  0.21446 2.982991 0.167627
H  0.892533 2.771884 1.806339
H  1.887172 3.496514 0.526389
H  -0.114193 -2.366643 1.011214
H  -0.349514 -2.302399 -0.746518
H  1.031626 -3.236566 -0.059904
H  4.512273 -0.164822 -0.887701
