program: Gaussian 09
title: 000078529
version: EM64L-G09RevD.01
frameworkgroup: C1[X(C7H15NO)]
method: RPBEPBE
basis: SDD
operation: Freq
keyword: #p
keyword: freq=noraman
keyword: PBEPBE/SDD
title: #p freq=noraman PBEPBE/SDD
converged: YES YES NO NO
title: Mulliken charges:
elementType: O N C C C C C C C H H H H H H H H H H H H H H H
charge: -0.462337 0.036615 -0.348504 -0.347521 -0.397707 -0.401469 -0.389584 -0.269198 -0.708127 0.247744 0.189892 0.191650 0.242388 0.248330 0.194873 0.194548 0.250668 0.180861 0.218175 0.195974 0.234024 0.212365 0.277520 0.208821
chargesum: 0.00000
title: Mulliken charges with hydrogens summed into heavy atoms:
elementType: O N C C C C C C C
charge: -0.462337 0.036615 0.089131 0.086517 0.045496 0.043747 0.009452 0.160800 -0.009420
polarizability: 9.87827251e+01 -4.86923995e-01 8.14123817e+01 5.56383512e-01 2.58168656e-01 7.76962406e+01
1716.lowfreq: -41.0952 -15.9460 -0.0004 -0.0002 -0.0002 5.9427 105.0729 135.6786 209.5121
frequency: 104.8484 135.6767 209.4908 210.2072 232.6070 307.7507 326.9295 352.7714 410.0096 420.7152 468.5115 486.6992 543.9650 652.5740 751.1441 788.0715 836.6807 844.9794 873.1015 887.1388 891.1928 924.0115 992.3081 1005.6699 1037.4073 1048.5520 1086.7690 1099.8615 1122.1011 1153.0531 1160.8557 1201.5333 1242.2408 1264.5301 1272.7282 1299.8555 1319.2718 1333.0054 1346.9217 1350.0444 1356.7595 1363.6383 1383.2615 1434.8755 1438.5746 1446.9248 1451.5976 1457.8441 1471.5006 1474.6066 1493.2739 2961.9686 2973.0106 2979.7441 2988.3744 2993.7289 3001.0296 3002.4341 3040.1635 3066.1515 3069.7146 3072.3323 3087.4759 3092.6587 3100.5356 3105.7858
redmass: 2.3086 2.3375 2.6644 1.8988 1.2082 2.3190 2.8199 2.7598 2.1780 3.0635 3.1131 2.2361 2.2270 3.2513 1.6891 1.3419 3.0413 2.5591 2.3425 1.9310 2.2522 1.7628 1.6137 1.7363 2.7446 1.9129 2.1114 1.7666 1.4871 1.9405 1.5596 1.6475 1.2215 1.1988 1.2472 1.2826 1.2573 1.3441 1.3982 1.3868 1.4149 1.2494 1.3268 1.0851 1.0910 1.0882 1.0875 1.0942 1.0889 1.0582 1.0521 1.0653 1.0641 1.0632 1.0412 1.0574 1.0618 1.0632 1.0953 1.1009 1.0997 1.1001 1.0993 1.0988 1.1016 1.0972
irintensity: 0.8756 4.2418 5.8204 6.4190 2.4318 8.9442 4.9746 11.4972 3.0848 4.8591 4.0351 4.9436 0.7784 1.0575 0.7780 4.5763 7.4259 15.2550 7.4643 3.0772 7.9892 12.0263 11.6092 2.9299 4.2335 1.7590 3.2250 1.3600 1.1331 0.3885 0.0520 0.4456 7.0163 5.5644 2.2997 4.1060 2.2261 0.4259 1.3894 4.4845 6.0483 20.9427 24.8465 5.5673 7.0782 10.9187 24.1767 3.7503 13.0975 8.6265 12.1813 41.4019 5.9757 15.3555 38.0521 82.5106 53.3611 29.8935 49.3952 11.8883 4.8689 27.8154 4.8703 41.1434 28.5348 17.2385
temp: 298.150 k
press: 1.00000 atm
elementType: 8 7 6 6 6 6 6 6 6 1 1 1 1 1 1 1 1 1 1 1 1 1 1 1
symmnumber: 1
zpe: 564061.7 jmol-1
zpe.correction: 0.214840 hartree
zpe.thermalcorrener: 0.224184 hartree
zpe.thermalcorrenthalpy: 0.225129 hartree
zpe.thermalcorrgfe: 0.181436 hartree
zpe.sumelectzpe: -404.891577 hartree
zpe.sumelectthermal: -404.882233 hartree
zpe.sumelectthermalent: -404.881289 hartree
zpe.sumelectthermalfe: -404.924981 hartree
dipole: 0.5124 0.0638 -4.1508
dipole: 4.1828
quadrupole: -53.4245 -53.8270 -62.1453
quadrupole: 0.1703 2.9590 1.1590
quadrupole: 3.0411 2.6386 -5.6797 0.1703 2.9590 1.1590
hfenergy: -405.1064172 hartree
pointgroup: C01 [X(C7H15N1O1)]
dipole: 0.2141048 -0.0730164 1.6300324 debye
dipolederiv: -0.6945216 -0.0004643 -0.0265224 -0.0093317 -0.5283195 0.0311014 0.0203381 -0.0091332 -0.5412982 0.0258711 -0.0104358 0.0287862 -0.0108028 0.0529093 -0.0410125 0.0210565 -0.024823 0.2759911 0.0662577 -0.0693005 0.0037001 -0.0635119 0.1541691 0.0236849 0.0044223 -0.0134264 0.1299505 0.1262579 0.0784258 -0.0033456 0.0915163 0.1366146 -0.0141061 0.001913 0.0280088 0.145082 0.0202022 0.0077078 0.0266864 0.0270651 0.0721477 -0.0339362 -0.0098421 0.012981 0.0481223 0.0024532 0.0121445 0.0330871 -0.0115315 0.0657238 0.0217232 -0.0089464 -0.0094261 0.0540432 0.0713316 -0.0073832 -0.0016449 -0.0125718 0.0188122 -0.0022163 0.0334062 -0.008975 0.1841657 0.291302 -0.0215728 0.0306036 -0.0184868 0.0850662 -0.0084339 -0.0246816 -0.0099684 0.1384895 -0.1543992 -0.0858565 -0.0297044 -0.0535473 0.0466364 -0.0559797 0.050878 -0.0424425 -0.0632027 -0.0316411 -0.1074247 -0.0200597 -0.0835753 -0.0118388 0.0007664 -0.0494427 -0.025825 0.0636656 0.0476382 0.0500531 -0.0108865 0.0506775 0.0100232 -0.0076787 0.0139114 0.0400666 -0.1871151 0.0090269 -0.0509608 -0.0018722 -0.0566867 0.0469998 0.0236468 -0.001143 -0.0380769 -0.1938961 -0.000766 0.1123921 -0.0171245 0.0663284 -0.0744031 0.0008579 -0.0343592 0.0423082 0.0718918 0.0795481 -0.0475994 -0.0236789 -0.0612177 0.1052083 0.0179424 0.0261847 -0.0568375 -0.0744214 0.011446 0.0693393 -0.0111657 0.0649925 -0.1746938 0.0487775 -0.0235887 0.0775323 0.0848037 -0.0540353 -0.1188297 -0.0336902 -0.1066872 -0.1033796 -0.0517258 -0.0542526 -0.0760839 0.0789021 0.1192117 0.046389 -0.0245297 0.0540213 0.0682928 -0.0037156 0.0482677 0.0515827 -0.0745657 0.0668848 -0.0085176 -0.0063139 -0.0066645 0.0173539 0.0055261 -0.0904508 0.0195775 -0.2012038 -0.183923 0.0399644 0.0765158 0.0398698 0.0481001 -0.0134829 0.1144956 -0.019615 0.0412876 -0.0327119 -0.0018919 -0.0447602 -0.0098534 0.0771623 0.0085429 0.0005597 -0.0231072 -0.1904133 0.0335057 -0.008127 0.0099308 0.0330889 -0.1231481 0.0071788 -0.0042784 0.0492471 0.0707891 -0.1488367 0.0568311 0.0490825 0.0846989 0.0562535 -0.0262107 0.0662628 -0.0244311 0.1139782 0.2363886 0.024548 0.0307588 0.0129018 0.0922966 -0.0038678 -0.0817302 -0.0284634 -0.0257351 0.0935089 0.0405692 -0.0338524 -0.0206919 -0.1379869 0.0726178 -0.0189805 0.0893304 0.0506891 unknown
polarizability: 98.7639889|0.6520036|81.4029382|-0.6980358|0.3612512|77.7244203 unknown
InChI: InChI=1S/C7H15NO/c1-2-8(9)6-4-3-5-7-8/h2-7H2,1H3
charge 0 multiplicity 1
24 atoms
O  -0.607282 0.241008 -1.441974
N  -0.517482 0.192312 -0.019013
C  0.013294 -1.185751 0.435262
C  0.457098 1.281118 0.479677
C  1.400549 -1.433332 -0.172743
C  1.849337 1.058278 -0.123975
C  2.405831 -0.336277 0.246573
C  -1.905469 0.468148 0.608669
C  -2.978949 -0.464789 0.044937
H  -0.714998 -1.923509 0.065924
H  0.03887 -1.205162 1.543892
H  0.48044 1.25277 1.588485
H  0.024613 2.236318 0.139874
H  1.279239 -1.43138 -1.27113
H  1.751512 -2.435981 0.137546
H  2.52351 1.86207 0.228242
H  1.748396 1.14364 -1.220799
H  2.588872 -0.39098 1.340801
H  3.379114 -0.502089 -0.251609
H  -1.814372 0.401553 1.711161
H  -2.126375 1.511006 0.324382
H  -3.981333 -0.067428 0.283331
H  -2.850411 -0.495924 -1.051317
H  -2.916305 -1.489318 0.451803
