program: Gaussian 09
title: 000078531
version: EM64L-G09RevD.01
frameworkgroup: C1[X(C12H19N)]
method: RPBEPBE
basis: SDD
operation: Freq
keyword: #pfreq=noraman
keyword: PBEPBE/SDD
title: #p freq=noraman PBEPBE/SDD
converged: YES YES NO NO
title: Mulliken charges:
elementType: N C C C C C C C C C C C C H H H H H H H H H H H H H H H H H H H
charge: -0.005253 0.387533 -0.018234 -0.469087 -0.559773 -0.364804 0.510556 -0.492264 -0.534711 -0.563586 -0.682104 -0.689707 -0.675199 0.224881 0.194087 0.212805 0.218636 0.196001 0.227750 0.246997 0.209555 0.210188 0.244585 0.222526 0.219842 0.222556 0.215018 0.207288 0.219787 0.220091 0.218323 0.225718
chargesum: 0.00000
title: Mulliken charges with hydrogens summed into heavy atoms:
elementType: N C C C C C C C C C C C C
charge: -0.005253 0.387533 -0.018234 -0.050119 -0.128332 0.058946 0.510556 -0.245267 -0.114967 -0.319001 -0.017179 -0.047615 -0.011067
polarizability: 1.78813484e+02 6.09835602e+00 1.35290734e+02 -5.89999252e+00 7.47804285e+00 9.67482022e+01
1716.lowfreq: -9.4275 -0.0007 -0.0006 -0.0005 3.8782 10.4379 30.9666 47.2878 56.1580
frequency: 30.2391 47.1822 56.1227 73.9383 91.7723 116.4525 141.0512 191.8130 209.9482 230.1380 238.5867 281.7799 290.0350 325.4961 338.8374 403.5166 440.9154 481.2420 539.2896 561.8616 629.8395 689.4003 737.1963 744.1762 782.7568 789.5274 812.2337 864.7714 886.9866 909.3541 914.2338 936.3102 965.1217 1003.4677 1026.3819 1050.0271 1056.2412 1062.9802 1067.2851 1073.9998 1092.3693 1146.3899 1199.9476 1223.6521 1237.3103 1246.3188 1254.8505 1280.6426 1284.1866 1294.9590 1309.6766 1320.7261 1325.4921 1336.7809 1386.4820 1387.3616 1388.1456 1407.0070 1447.0795 1463.4663 1471.7524 1472.3525 1473.9250 1474.8405 1476.4181 1481.4179 1486.1811 1488.8729 1495.2665 1547.8160 1595.7482 2970.7920 2975.2762 2979.8147 2980.4057 2983.6850 2991.8963 2998.4525 3027.1082 3035.5189 3043.3098 3059.2534 3071.0901 3074.1203 3078.0898 3078.7734 3083.6888 3084.2353 3102.1163 3107.0053
redmass: 2.5685 2.8313 3.5224 2.3056 1.7916 3.3878 3.4370 1.1916 1.1003 1.1207 2.8362 2.4946 2.1758 2.9350 2.2475 4.1228 2.4739 4.1976 3.8489 3.7352 3.5844 6.1685 1.5548 1.4884 1.1775 1.4935 2.9317 1.3007 2.0066 2.7444 1.5385 1.3742 2.3706 2.6038 1.7249 2.8535 1.7975 1.9278 1.6944 1.4650 2.1401 2.1904 1.8842 1.5254 1.8711 1.3254 1.3267 1.3081 1.4115 1.3424 1.4198 2.7287 1.8982 1.5374 1.2553 1.2139 1.1978 2.6554 1.8616 1.3623 1.0461 1.0459 1.0597 1.0822 1.0481 1.0527 1.0780 1.0959 1.0988 6.4554 6.0494 1.0363 1.0610 1.0355 1.0350 1.0597 1.0615 1.0607 1.0972 1.1011 1.0997 1.1013 1.0996 1.1019 1.1001 1.1000 1.1010 1.1010 1.0910 1.0918
irintensity: 0.0618 0.2978 1.3592 0.1728 0.0425 0.0124 0.0048 0.1986 0.0027 0.0212 0.1442 0.1006 0.5405 0.8802 0.2318 1.9061 2.1064 1.2564 2.0776 1.0963 3.5249 1.6910 3.6964 5.4511 4.2007 4.1347 2.0120 1.8887 5.3064 6.8385 15.8310 0.3141 5.0859 4.0002 1.8000 0.8249 14.1746 10.1845 5.7917 0.5709 22.2899 3.5903 0.7414 0.2584 0.2770 1.2274 1.5209 1.6943 2.2504 1.8747 2.6653 0.4461 1.9612 3.8811 12.3816 9.9140 5.7500 23.1117 32.2592 22.9190 5.5902 18.7575 4.4099 10.3662 11.3259 3.1187 15.3633 18.5095 7.0884 5.4149 0.9124 49.4533 12.8527 28.2895 48.4343 35.0304 36.3907 35.9639 2.0729 8.0381 9.2704 0.5793 56.8317 76.7340 77.1373 34.0815 32.4181 42.5088 29.6246 25.4422
temp: 298.150 k
press: 1.00000 atm
elementType: 7 6 6 6 6 6 6 6 6 6 6 6 6 1 1 1 1 1 1 1 1 1 1 1 1 1 1 1 1 1 1 1
symmnumber: 1
zpe: 737585.0 jmol-1
zpe.correction: 0.280931 hartree
zpe.thermalcorrener: 0.295689 hartree
zpe.thermalcorrenthalpy: 0.296633 hartree
zpe.thermalcorrgfe: 0.238131 hartree
zpe.sumelectzpe: -522.424051 hartree
zpe.sumelectthermal: -522.409293 hartree
zpe.sumelectthermalent: -522.408349 hartree
zpe.sumelectthermalfe: -522.466851 hartree
dipole: -0.9531 2.1146 0.9974
dipole: 2.5248
quadrupole: -72.9583 -80.8902 -82.6839
quadrupole: 2.4121 -0.9661 -0.0652
quadrupole: 5.8859 -2.0461 -3.8398 2.4121 -0.9661 -0.0652
hfenergy: -522.7049821 hartree
pointgroup: C01 [X(C12H19N1)]
dipole: -0.3531201 -0.8598133 -0.3503779 debye
polarizability: 179.1303969|-4.6271158|135.6459526|5.7829705|5.7471949|96.0760702 unknown
InChI: InChI=1S/C12H19N/c1-4-7-12-11(6-3)8-10(5-2)9-13-12/h8-9H,4-7H2,1-3H3
charge 0 multiplicity 1
32 atoms
N  0.038245 1.519512 0.525693
C  0.118068 -0.802167 -0.248316
C  0.73929 0.361943 0.30374
C  2.220948 0.431229 0.63461
C  0.875435 -2.104347 -0.469382
C  3.067784 0.934036 -0.568989
C  -2.004357 0.457366 -0.322931
C  -1.262342 -0.726306 -0.553884
C  -3.494425 0.545558 -0.607413
C  -1.288038 1.553479 0.217992
C  0.862484 -3.014429 0.789216
C  4.567678 1.048467 -0.224837
C  -4.352385 -0.129801 0.496236
H  2.347248 1.139626 1.473378
H  2.604132 -0.552378 0.966151
H  0.415958 -2.655136 -1.312746
H  1.92213 -1.900583 -0.760162
H  2.930971 0.250379 -1.431321
H  2.673785 1.919517 -0.882604
H  -1.763148 -1.604754 -0.983583
H  -3.79143 1.607994 -0.69722
H  -3.71979 0.068733 -1.581429
H  -1.799545 2.505398 0.413746
H  1.327285 -2.505547 1.653094
H  1.416983 -3.952485 0.603405
H  -0.172865 -3.275559 1.07356
H  4.72681 1.748262 0.616974
H  4.987164 0.067725 0.070091
H  5.150402 1.419657 -1.087871
H  -4.096822 -1.200422 0.59661
H  -5.429506 -0.054496 0.259357
H  -4.179747 0.349426 1.476632
