program: Gaussian 09
title: 000078532
version: EM64L-G09RevD.01
frameworkgroup: C1[X(C9H13N)]
method: RPBEPBE
basis: SDD
operation: Freq
keyword: #pfreq=noraman
keyword: PBEPBE/SDD
title: #p freq=noraman PBEPBE/SDD
converged: YES YES NO NO
title: Mulliken charges:
elementType: N C C C C C C C C C H H H H H H H H H H H H H
charge: -0.007648 -0.029981 -0.571750 0.497256 -0.700557 -0.700447 -0.339765 -0.339551 -0.338991 -0.339079 0.204615 0.212230 0.212270 0.230286 0.205758 0.215220 0.215182 0.230280 0.205769 0.232481 0.232506 0.236965 0.236953
chargesum: 0.00000
title: Mulliken charges with hydrogens summed into heavy atoms:
elementType: N C C C C C C C C C
charge: -0.007648 0.174634 -0.147250 0.497256 -0.049293 -0.049217 -0.107284 -0.107046 -0.102026 -0.102126
polarizability: 1.17864993e+02 -8.29017696e-03 1.05167082e+02 -1.17639821e+01 -7.81984849e-03 7.07031209e+01
1716.lowfreq: -15.9810 -13.5587 -0.0006 -0.0002 0.0006 11.0256 47.0554 92.8151 94.8698
frequency: 46.6318 92.7345 94.7704 215.7737 239.3807 247.9183 273.6923 362.4226 372.0945 384.9925 440.5283 489.8159 618.6391 663.7978 737.5631 764.4482 816.1312 835.6641 882.5224 889.4662 922.8875 952.0356 961.0877 962.3216 968.9068 974.6391 1061.4145 1062.8114 1088.7063 1104.0463 1179.5307 1217.4564 1219.5702 1227.0756 1262.3360 1308.7332 1327.0786 1340.6578 1346.8259 1380.8091 1397.4986 1404.5948 1466.2673 1466.2959 1467.8399 1473.7037 1485.0025 1488.3531 1553.6198 1587.8815 2962.6813 2972.1526 2974.6691 2984.4892 3037.5008 3065.7897 3070.2106 3071.7279 3077.8107 3122.7360 3123.7575 3145.1619 3151.8495
redmass: 3.0351 2.6716 4.3496 1.0712 3.0632 1.1711 3.2074 2.1421 2.4477 1.7524 3.0993 4.2223 3.0139 6.8050 4.0385 2.6627 2.5954 1.7181 1.5191 1.2517 1.2050 1.8044 6.5268 1.5299 1.5108 1.4831 1.7385 2.2079 1.4830 1.4448 2.0429 1.4764 1.3301 2.1075 1.4654 4.2330 1.6106 1.3288 1.3814 1.2237 1.2185 2.0283 1.2462 1.4500 1.1424 1.0555 1.0497 1.0553 6.5691 5.7207 1.0778 1.0351 1.0378 1.0637 1.1025 1.0999 1.0986 1.1000 1.0991 1.0861 1.0888 1.0959 1.0991
irintensity: 0.0001 0.1345 0.2960 0.0166 0.3741 0.7233 0.0984 0.3364 0.0035 0.0782 3.0078 14.8332 16.5385 0.3700 5.0792 10.2191 5.8879 38.2887 1.6339 0.0006 1.7384 0.2332 2.8144 0.0889 0.7492 0.0307 0.0093 2.4726 4.1581 1.9812 7.9485 4.5718 1.1898 2.9613 24.8325 1.3737 0.4337 2.3612 5.1517 21.8116 13.9736 19.9648 5.6205 6.8924 3.1679 0.2219 18.0718 18.1388 11.3630 49.0330 16.6126 41.9817 23.9214 47.7978 18.5831 24.8039 57.2664 2.5180 93.2936 6.9437 13.6305 57.6339 0.0539
temp: 298.150 k
press: 1.00000 atm
elementType: 7 6 6 6 6 6 6 6 6 6 1 1 1 1 1 1 1 1 1 1 1 1 1
symmnumber: 1
zpe: 519714.7 jmol-1
zpe.correction: 0.197949 hartree
zpe.thermalcorrener: 0.207883 hartree
zpe.thermalcorrenthalpy: 0.208828 hartree
zpe.thermalcorrgfe: 0.162471 hartree
zpe.sumelectzpe: -404.742876 hartree
zpe.sumelectthermal: -404.732942 hartree
zpe.sumelectthermalent: -404.731997 hartree
zpe.sumelectthermalfe: -404.778354 hartree
dipole: -3.2121 -0.0017 1.1013
dipole: 3.3956
quadrupole: -70.3113 -55.1640 -63.4372
quadrupole: -0.0080 1.1421 -0.0006
quadrupole: -7.3405 7.8068 -0.4664 -0.0080 1.1421 -0.0006
hfenergy: -404.940825 hartree
pointgroup: C01 [X(C9H13N1)]
dipole: 1.2703958 0.0257088 -0.4125437 debye
dipolederiv: -0.3854911 -0.0003709 0.0258182 -0.0007879 -0.381754 -0.0008909 0.0621648 -0.0002697 -0.2643401 0.2680709 0.0018664 0.0088908 0.0001793 0.1530183 0.0001557 0.1773242 0.0030731 0.1532097 -0.1551507 -0.0040299 -0.0312783 -0.0027528 0.0973683 -0.0001605 -0.1615589 -0.0025354 0.0770605 0.4445851 0.007077 -0.099144 0.0080995 0.0917359 -0.0001813 -0.1985387 -0.0018661 -0.0401685 0.0178479 -0.0042619 -0.0231678 0.0189551 -0.0431224 -0.0725987 -0.0547742 -0.0673979 -0.0054766 0.0182946 0.0067883 -0.0253918 -0.0158254 -0.0463835 0.0708788 -0.0573244 0.0646618 -0.0025434 -0.28052 -0.171968 0.0368954 -0.136228 -0.0297817 0.0380456 0.0747766 0.0598518 -0.1186201 -0.2902286 0.1624645 0.0421074 0.1260718 -0.0178753 -0.0343966 0.0795883 -0.0549063 -0.1207824 0.2104666 0.1670985 -0.1005229 0.0430885 0.2829577 -0.0042791 -0.1280631 -0.066467 -0.0320569 0.2173815 -0.1668523 -0.1045867 -0.0422931 0.2743721 0.0079228 -0.1312425 0.069265 -0.0304126 -0.1999414 -0.0050105 0.1165462 -0.0045806 0.0251939 0.0026591 0.0775318 0.0020326 -0.0463032 0.0113909 -0.0106784 0.0132125 0.0185427 -0.0754069 -0.1580226 0.0389223 -0.0846819 -0.0128337 0.0115464 0.0134446 0.0082253 -0.0162207 -0.0806786 0.1568951 0.0357419 0.0844576 -0.0076931 -0.0509334 0.0266787 0.1294596 -0.0134628 0.0577402 0.0062169 0.1331676 -0.0017792 0.0184865 0.1050224 0.0259229 -0.0011091 0.0024146 -0.1283133 0.0906382 0.0201655 0.134929 -0.0052139 -0.1024593 -0.0337677 -0.1399009 0.0106896 0.0867487 -0.004066 -0.1492462 -0.0345045 -0.0229969 -0.102714 0.0301662 -0.1393616 -0.0139936 0.0866751 0.0015488 -0.1507546 0.0317105 -0.0225963 -0.0505285 -0.0331234 0.1288324 0.0068608 0.0570376 -0.0009912 0.1330947 0.0071 0.0187988 0.1056207 -0.0177976 0.0016826 0.0052315 -0.124247 -0.0930569 0.0250415 -0.1366794 -0.0099318 0.0560546 0.108869 0.047514 0.0824547 -0.0505453 -0.0263113 0.0498485 -0.0418064 0.1168527 0.0623015 -0.1061548 0.0441802 -0.0799211 -0.0582501 0.0237755 0.0465919 0.0393507 0.1183538 0.0474128 -0.084975 0.0291428 -0.0774222 -0.0916608 0.0234645 0.0372502 0.0334942 0.1203111 0.0419713 0.0886143 0.0319558 0.0809001 -0.084829 -0.0272459 0.0402929 -0.0370326 0.1188965 unknown
polarizability: 118.2285242|0.3574407|105.1706417|-10.991496|0.2229217|70.3360299 unknown
InChI: InChI=1S/C9H13N/c1-8(2)7-9-3-5-10-6-4-9/h3-6,8H,7H2,1-2H3
charge 0 multiplicity 1
23 atoms
N  -2.784079 -0.060564 0.511778
C  2.426694 0.033623 -0.103921
C  1.278235 0.025631 -1.173153
C  -0.129765 -0.004218 -0.602697
C  2.393044 1.29876 0.784537
C  2.435429 -1.250186 0.757924
C  -0.799875 -1.226309 -0.331335
C  -0.839247 1.188721 -0.303172
C  -2.101767 -1.20826 0.216912
C  -2.139829 1.115343 0.243701
H  3.371071 0.055394 -0.688204
H  1.428458 -0.856193 -1.826125
H  1.398251 0.925718 -1.807268
H  1.477996 1.327345 1.403963
H  2.422899 2.22211 0.175406
H  3.262617 1.315039 1.467174
H  3.304333 -1.250984 1.441623
H  1.521175 -1.32304 1.374859
H  2.497565 -2.159025 0.129713
H  -0.316476 -2.184489 -0.552948
H  -0.387568 2.16714 -0.502045
H  -2.632229 -2.143751 0.429885
H  -2.700635 2.027795 0.477893
