program: Gaussian 09
title: 000078534
version: EM64L-G09RevD.01
frameworkgroup: C1[X(C7H4ClN3O2)]
method: RPBEPBE
basis: SDD
operation: Freq
keyword: #p
keyword: freq=noraman
keyword: PBEPBE/SDD
title: #p freq=noraman PBEPBE/SDD
converged: NO YES NO YES
title: Mulliken charges:
elementType: Cl O O N N N C C C C C C C H H H H
charge: 0.050349 -0.207647 -0.209871 -0.307143 -0.041975 0.015980 0.441738 0.012272 -0.486874 0.408163 -0.261819 -0.271898 -0.356755 0.305536 0.262644 0.288639 0.358659
chargesum: 0.00000
title: Mulliken charges with hydrogens summed into heavy atoms:
elementType: Cl O O N N N C C C C C C C
charge: 0.050349 -0.207647 -0.209871 0.051517 -0.041975 0.015980 0.441738 0.012272 -0.181338 0.408163 0.000825 -0.271898 -0.068116
polarizability: 1.85369132e+02 3.26682596e+00 1.32714950e+02 -7.84507381e-03 6.85249202e-03 4.24982027e+01
1716.lowfreq: -8.7510 -6.6057 -0.0027 -0.0016 -0.0015 1.4256 54.9701 103.7015 121.6064
frequency: 54.9578 103.7015 121.6061 138.6823 232.0686 274.7198 324.5897 338.6471 405.3828 430.5788 454.7881 530.7647 565.9770 590.9010 606.8348 677.9696 702.0881 704.9962 761.8628 764.1897 789.5190 839.5671 912.7663 930.9891 986.4886 989.2564 1063.2894 1080.1007 1130.4985 1211.0947 1221.8221 1249.9917 1311.0634 1321.5018 1373.5015 1396.5084 1437.8236 1484.7990 1507.5041 1559.6560 1634.3997 3170.2052 3181.2475 3192.8052 3593.3270
redmass: 16.0415 7.7572 19.8553 5.8632 9.2502 5.7023 8.1844 12.1480 12.0200 2.8827 9.3675 5.4807 5.1677 7.9810 10.0220 9.2717 1.5255 2.5115 8.4710 4.0161 6.0055 1.6242 6.6193 1.4958 3.6996 1.3099 3.5343 4.3208 1.4304 7.5729 2.0585 1.8839 5.1039 2.9948 10.0985 3.5923 1.9546 6.1110 5.4256 8.8125 8.3149 1.0891 1.0934 1.0969 1.0826
irintensity: 0.0004 0.9103 0.2593 0.1285 2.6584 7.6932 0.0166 0.0541 5.3211 13.4545 1.7840 8.4289 0.0055 2.8778 0.0000 26.9018 30.2465 93.6784 10.5339 0.0163 9.5457 35.8684 10.6387 27.7166 19.5828 0.8387 55.5883 26.0358 23.5905 394.7556 16.2496 16.7753 3.1514 16.3900 116.1531 15.8210 70.9097 4.2022 13.3519 0.3924 98.3603 2.4693 4.4530 3.5232 152.9533
temp: 298.150 k
press: 1.00000 atm
elementType: 17 8 8 7 7 7 6 6 6 6 6 6 6 1 1 1 1
symmnumber: 1
zpe: 283246.0 jmol-1
zpe.correction: 0.107883 hartree
zpe.thermalcorrener: 0.117934 hartree
zpe.thermalcorrenthalpy: 0.118879 hartree
zpe.thermalcorrgfe: 0.071025 hartree
zpe.sumelectzpe: -1042.892043 hartree
zpe.sumelectthermal: -1042.881991 hartree
zpe.sumelectthermalent: -1042.881047 hartree
zpe.sumelectthermalfe: -1042.928901 hartree
dipole: -5.6851 1.4752 0.0008
dipole: 5.8734
quadrupole: -85.2540 -83.3272 -81.4175
quadrupole: 8.5012 0.0025 -0.0014
quadrupole: -1.9211 0.0057 1.9154 8.5012 0.0025 -0.0014
hfenergy: -1042.9999257 hartree
pointgroup: C01 [X(C7H4Cl1N3O2)]
dipole: 2.3040757 0.1758 -0.000324 debye
dipolederiv: -0.2097748 0.1992135 0.0000056 0.3429938 -0.5847512 0.0000041 0.0000024 0.0000097 0.047144 -0.9189527 0.2091445 -0.0000235 0.1827174 -0.5624908 0.0000892 0.0001316 -0.0000439 -0.2304801 -0.6428817 -0.1398608 0.0000492 -0.3751641 -0.750971 0.0000241 0.0001444 0.0001809 -0.2299284 -0.7246333 0.0763659 0.0000277 -0.1463057 0.1580681 -0.0000032 0.0000263 -0.0000251 -0.1435978 -0.5094017 0.1555407 0.0000161 -0.1470919 -0.3524375 0.0000087 0.0000287 0.0000023 -0.183278 1.9897983 0.0237017 -0.0001175 0.3802881 1.0788095 -0.0001516 -0.0002216 -0.0001236 0.1840216 -0.5264935 0.0109956 0.0000411 -0.0735175 -0.3227487 0.000016 0.0000402 0.0000131 0.0625286 0.4394028 -0.1378817 -0.0000175 0.16725 -0.0328447 -0.0000084 -0.000037 0.0000108 0.013445 0.6512076 -0.0147163 -0.0000488 -0.1178377 -0.0841957 0.0000145 -0.000082 -0.000014 -0.0904278 -0.942628 0.0051017 0.0000967 -0.0029881 0.0621578 0.0000229 0.000048 -0.0000145 0.0553623 -0.1499319 0.0215699 0.0000052 -0.0061364 0.1357644 -0.000011 -0.0000199 -0.0000105 -0.1158571 0.9024677 -0.4034016 -0.0000399 -0.4064036 0.880061 -0.0000029 -0.0000216 -0.0000034 -0.0829853 0.0130769 -0.0825191 0.0000003 0.1781768 0.0262414 -0.0000239 -0.0000654 -0.0000012 -0.1377594 0.1138259 -0.001917 0.0000032 -0.0138425 0.068986 0.0000037 -0.0000038 0.0000087 0.1797839 0.0770667 -0.0306918 0.0000081 -0.0015809 -0.0294188 0.0000094 0.0000189 0.0000073 0.1616702 0.0780622 0.0791513 -0.0000024 0.0131581 0.1003957 0.000003 0.0000116 -0.0000004 0.1751568 0.3597896 0.0302034 -0.0000033 0.0262843 0.2093744 0.0000056 -0.000001 0.0000037 0.3352013 unknown
polarizability: 182.5862931|-12.2252234|135.4977896|-0.008933|-0.0053575|42.4982027 unknown
InChI: InChI=1S/C7H4ClN3O2/c8-7-5-3-4(11(12)13)1-2-6(5)9-10-7/h1-3,10H
charge 0 multiplicity 1
17 atoms
Cl 2.770356 -2.561112 -0.000011
O  -3.788885 0.408576 0.000323
O  -3.000554 -1.731628 0.000535
N  3.104902 0.186307 -0.000128
N  2.495658 1.438312 -0.000168
N  -2.824352 -0.451277 0.000124
C  0.924642 -0.317696 -0.000016
C  1.150129 1.12182 -0.000092
C  -0.386814 -0.857853 0.000072
C  -1.436232 0.06567 0.000075
C  0.043878 2.025355 -0.000087
C  2.22678 -0.869247 -0.000044
C  -1.242243 1.492124 -0.000004
H  -0.591239 -1.93149 0.000135
H  0.217383 3.104842 -0.000146
H  -2.127561 2.132344 -0.000003
H  4.123853 0.138152 -0.000165
