program: Gaussian 09
title: 000078523
version: EM64L-G09RevD.01
frameworkgroup: C1[X(C3H4ClNO3S)]
method: RPBEPBE
basis: SDD
operation: Freq
keyword: #p
keyword: freq=noraman
keyword: PBEPBE/SDD
title: #p freq=noraman PBEPBE/SDD
converged: NO NO NO NO
title: Mulliken charges:
elementType: Cl S O O O N C C C H H H H
charge: -0.002664 0.969048 -0.480618 -0.480616 -0.113206 -0.290336 -0.472461 -0.556975 0.211348 0.310270 0.310257 0.298013 0.297941
chargesum: 0.00000
title: Mulliken charges with hydrogens summed into heavy atoms:
elementType: Cl S O O O N C C C
charge: -0.002664 0.969048 -0.480618 -0.480616 -0.113206 -0.290336 0.148066 0.038978 0.211348
polarizability: 1.47162978e+02 -3.72050534e+00 7.12940030e+01 1.37975942e-02 -9.53911564e-03 6.09228905e+01
1716.lowfreq: -9.3532 -8.7843 -0.0032 -0.0029 -0.0023 11.7642 26.9592 47.7751 56.3503
frequency: 25.8659 47.6799 56.3060 72.6063 128.7452 183.7051 203.1458 239.4743 262.3774 263.4402 365.8280 448.1978 531.0731 564.0826 604.6862 687.6702 789.9120 832.4496 922.0615 999.8023 1066.4976 1114.2273 1234.5376 1237.7775 1259.5399 1296.8437 1413.0736 1470.5745 2111.2929 3072.4429 3078.6665 3155.0288 3177.8464
redmass: 8.0299 4.1392 15.7585 3.5128 12.3625 15.7392 5.8309 5.5302 6.0699 13.8360 11.6032 18.7174 12.6689 7.9082 12.6021 6.5995 1.1425 18.2452 2.8132 1.9598 4.2034 1.1028 1.7905 2.6796 1.1968 1.1874 1.1075 1.0972 12.7193 1.0592 1.0541 1.1127 1.1121
irintensity: 0.1603 1.1782 1.2140 7.0174 6.4551 4.3274 2.5955 25.5120 4.8756 5.0869 43.5600 214.3828 12.6918 3.7797 13.6878 9.8579 3.2369 60.8764 52.1728 27.7444 8.9379 9.7442 22.3614 31.9311 0.5353 4.8849 9.2964 10.3690 1094.1244 4.3314 5.6100 1.5094 0.2427
temp: 298.150 k
press: 1.00000 atm
elementType: 17 16 8 8 8 7 6 6 6 1 1 1 1
symmnumber: 1
zpe: 196890.1 jmol-1
zpe.correction: 0.074991 hartree
zpe.thermalcorrener: 0.086046 hartree
zpe.thermalcorrenthalpy: 0.086990 hartree
zpe.thermalcorrgfe: 0.035211 hartree
zpe.sumelectzpe: -1254.378301 hartree
zpe.sumelectthermal: -1254.367246 hartree
zpe.sumelectthermalent: -1254.366302 hartree
zpe.sumelectthermalfe: -1254.418081 hartree
dipole: -2.7784 -1.3600 -0.0069
dipole: 3.0934
quadrupole: -77.2160 -70.4640 -70.5870
quadrupole: -3.3853 0.0038 0.0004
quadrupole: -4.4603 2.2916 2.1687 -3.3853 0.0038 0.0004
hfenergy: -1254.4532923 hartree
pointgroup: C01 [X(C3H4Cl1N1O3S1)]
dipole: -1.0592592 -0.599188 0.0100521 debye
dipolederiv: -0.6731971 -0.1499865 0.0038533 -0.1254026 -0.1996647 0.0018198 0.004216 0.0020954 -0.1137662 1.9254003 -0.2997841 0.003508 -0.4756023 1.4176078 -0.0015718 0.0060251 -0.0014264 1.2862459 -0.5989349 -0.0038079 -0.0067527 -0.0159651 -0.5339847 0.0368777 -0.0674273 0.1417607 -0.5706604 -0.5985216 -0.0042532 0.0069491 -0.0139418 -0.5395239 -0.0375833 0.0681694 -0.1428424 -0.5654779 -1.6367826 0.2465739 -0.0020316 -0.092723 -0.1012432 -0.0005825 0.002777 -0.0009627 -0.1529666 -2.2146581 0.5520909 -0.0053871 0.0976993 -0.3641664 -0.0001106 -0.0001473 -0.0004499 -0.3806713 0.3969722 0.087386 -0.0026307 0.2085935 -0.0267946 -0.0004247 -0.0049013 -0.000563 -0.0577686 0.5656969 0.234817 -0.0050277 -0.0907932 0.1920812 -0.0012638 -0.0000761 -0.0016346 0.1469062 2.7742286 -0.4631648 0.0039784 0.5188045 -0.0292368 0.0033077 -0.0088904 0.0043033 0.2644106 -0.0071474 -0.0254998 0.0121282 0.0078762 0.0611476 -0.0344679 0.068629 -0.0183986 0.0507295 -0.0073063 -0.0259665 -0.0110964 0.0058775 0.0628061 0.0340716 -0.0687472 0.0179846 0.0493686 0.0369057 -0.0735697 0.0211818 -0.0124654 0.032692 0.0545114 -0.0233926 0.0667588 0.0197112 0.0373445 -0.0748352 -0.0186726 -0.0119575 0.0282796 -0.0545836 0.0237658 -0.066625 0.0239389 unknown
polarizability: 147.3358027|0.8171451|71.1173788|-0.1907411|-0.1876042|60.9266904 unknown
InChI: InChI=1S/C3H4ClNO3S/c4-1-2-9(7,8)5-3-6/h1-2H2
charge 0 multiplicity 1
13 atoms
Cl -4.107815 -0.919119 0.030581
S  0.149211 0.629617 -0.00612
O  0.242201 1.410659 -1.422039
O  0.249015 1.453279 1.384937
O  3.847923 -0.713556 0.009322
N  1.393201 -0.884706 0.013463
C  -1.40528 -0.54853 0.014959
C  -2.666125 0.296331 0.003809
C  2.637158 -0.724474 0.01077
H  -1.25642 -1.159878 -0.887183
H  -1.253706 -1.131485 0.935273
H  -2.781144 0.889213 -0.914444
H  -2.775219 0.922049 0.900771
