program: Gaussian 09
title: 000078590
version: EM64L-G09RevD.01
frameworkgroup: C1[X(C14H36N6)]
method: RPBEPBE
basis: SDD
operation: Freq
keyword: #pfreq=noraman
keyword: PBEPBE/SDD
title: #p freq=noraman PBEPBE/SDD
converged: YES YES NO NO
title: Mulliken charges:
elementType: N N N N N N C C C C C C C C C C C C C C H H H H H H H H H H H H H H H H H H H H H H H H H H H H H H H H H H H H
charge: -0.113741 -0.114242 -0.570121 -0.570583 -0.570113 -0.570463 -0.374763 -0.374271 -0.363035 -0.357572 -0.362438 -0.357294 -0.364691 -0.371040 -0.365246 -0.371563 -0.375049 -0.370469 -0.374708 -0.370003 0.212900 0.192878 0.192914 0.212794 0.197277 0.194516 0.196567 0.192503 0.197055 0.194487 0.196351 0.192550 0.181004 0.217196 0.180541 0.217389 0.180898 0.217361 0.180560 0.217537 0.209475 0.193012 0.205003 0.195347 0.209371 0.192952 0.205037 0.195109 0.268821 0.253519 0.268197 0.254873 0.268833 0.253507 0.268194 0.254881
chargesum: 0.00000
title: Mulliken charges with hydrogens summed into heavy atoms:
elementType: N N N N N N C C C C C C C C C C C C C C
charge: -0.113741 -0.114242 -0.047780 -0.047513 -0.047773 -0.047389 0.031014 0.031436 0.028757 0.031498 0.029103 0.031607 0.033509 0.026890 0.033014 0.026534 0.027437 0.029881 0.027614 0.030143
polarizability: 2.19919473e+02 -7.37592454e-02 1.97295464e+02 -5.44465898e+00 -1.38743237e-02 1.78264148e+02
1716.lowfreq: 0.0002 0.0003 0.0006 3.0732 3.9092 4.8634 13.7659 16.5264 26.6327
frequency: 13.6933 16.4117 26.2774 29.4376 29.7475 36.0964 43.1550 65.1568 68.8809 75.9276 77.4735 86.3270 102.6043 106.9214 124.4428 156.1477 175.3389 211.2512 221.3033 223.0514 226.9828 242.0256 248.8576 263.7619 276.2584 290.8814 308.9890 317.2050 317.4481 331.5089 355.4963 361.7809 407.5798 439.1079 456.8296 529.5172 533.8481 544.8354 561.9668 620.4498 620.9936 630.8439 631.6733 712.4578 742.4862 772.7549 785.7389 792.1127 819.2561 831.0868 838.4920 843.4195 847.6420 849.0874 937.2668 950.9281 978.9815 984.2300 1001.2594 1003.1733 1020.2902 1021.5050 1049.2950 1052.0795 1064.4115 1065.2180 1067.2216 1069.6584 1084.7770 1092.2067 1097.2279 1105.4010 1114.1185 1114.5201 1116.3215 1127.6837 1154.7236 1189.4911 1199.1810 1208.8089 1223.7981 1229.6169 1232.4196 1232.8080 1255.5522 1266.0567 1275.1881 1277.8413 1281.2219 1285.2451 1286.2906 1289.2777 1294.5029 1297.7105 1322.3538 1329.4852 1331.2758 1331.5609 1339.7760 1363.0234 1365.2689 1366.2750 1367.6184 1379.4122 1383.9984 1384.2038 1387.3309 1392.1548 1452.7293 1455.2390 1457.0436 1457.4604 1467.9632 1473.2074 1476.5567 1477.4784 1478.1587 1484.6434 1494.0704 1494.4835 1496.6495 1496.8451 1637.1016 1637.3970 1637.9723 1638.0283 2855.0415 2855.8579 2860.9703 2862.0438 2876.2767 2876.4882 2904.6084 2904.9705 2905.6042 2906.2286 2967.4500 2967.7381 2970.9349 2970.9976 3000.2819 3000.4871 3000.5887 3000.6844 3012.3938 3012.5309 3019.7725 3019.9595 3039.0690 3043.0706 3043.1525 3044.5481 3044.6995 3057.0404 3440.4782 3440.5776 3441.1698 3441.2716 3567.2022 3567.3502 3567.7923 3567.9022
redmass: 4.5160 4.4341 3.7219 3.9222 3.8898 3.0050 3.9790 2.4126 1.9751 2.0199 2.0535 2.4274 2.6295 2.5465 2.4596 3.4709 2.8871 1.6476 1.1903 1.1370 1.2242 1.5423 2.6027 2.4620 2.0977 2.0947 1.9859 2.6574 2.4371 2.6699 3.1116 2.5602 2.4324 2.8865 2.5240 2.5168 2.5342 2.7492 2.8198 1.2778 1.2788 1.2749 1.2707 2.1557 1.7978 1.2074 1.2496 1.2358 1.6053 1.8150 1.9150 2.0085 1.7219 1.7642 1.9313 1.8373 1.8107 1.7319 1.3441 1.4073 1.7769 1.7739 1.9746 2.5724 2.9860 3.2610 3.2780 3.0875 2.0122 2.2131 2.1237 2.1703 2.2803 2.2357 2.2636 1.5525 1.4694 2.0303 1.7626 2.0545 1.4256 1.3678 1.2973 1.2934 1.3108 1.2608 1.2379 1.2108 1.2733 1.1505 1.1255 1.2144 1.2652 1.2171 1.4046 1.3266 1.3127 1.3135 1.2979 1.3610 1.3681 1.3578 1.3816 1.4449 1.4968 1.4974 1.4527 1.4107 1.0845 1.0846 1.0848 1.0853 1.0730 1.0878 1.0904 1.0798 1.0813 1.0831 1.0866 1.0864 1.0837 1.0838 1.0935 1.0935 1.0933 1.0933 1.0716 1.0716 1.0718 1.0708 1.0703 1.0710 1.0679 1.0679 1.0680 1.0680 1.0654 1.0653 1.0650 1.0651 1.0893 1.0894 1.0888 1.0888 1.0869 1.0870 1.0874 1.0874 1.0855 1.0984 1.0987 1.0988 1.0992 1.0922 1.0448 1.0448 1.0449 1.0448 1.0969 1.0969 1.0969 1.0969
irintensity: 0.0072 0.0722 0.2323 0.2839 0.1392 0.8337 0.8339 0.7631 3.7810 7.4842 7.5671 1.9715 3.5423 4.4775 3.6191 4.2541 0.3642 37.1000 0.3375 89.6699 19.7505 55.1212 9.0916 3.4290 7.5161 9.6809 4.1357 6.9792 6.6298 0.0937 2.1649 7.2076 3.6145 4.7438 1.5862 38.9369 11.1514 17.2777 38.1336 189.1217 484.7091 230.9139 7.4314 6.2024 3.2325 0.3988 0.3418 6.2421 3.8213 5.2483 9.8702 0.0466 0.0401 6.8735 6.0397 7.0097 0.3083 32.2194 6.1857 0.0038 9.1248 2.8037 15.6662 0.0918 23.1476 1.6345 3.3063 29.5398 46.7301 30.8394 1.1727 18.8896 2.2137 17.3624 41.1280 12.7056 4.2501 14.2106 3.4980 29.5456 7.3353 10.1561 5.1089 0.5408 8.1059 10.5880 0.0442 13.7494 13.2847 0.5734 7.6356 0.4478 2.6103 5.4001 3.9789 0.0138 1.9381 5.0779 0.5548 3.1963 3.8271 10.2283 14.1340 3.8000 4.4609 2.3648 3.8722 3.3418 4.4437 0.2226 7.9537 1.8656 9.8812 13.5266 1.2708 15.7744 7.1280 2.0508 4.7236 12.4182 4.0946 0.6281 41.4186 35.5677 45.4820 28.6200 18.6449 49.1920 152.4171 12.0773 311.6358 92.7010 94.1880 97.1442 77.3997 81.2810 25.6786 29.6605 31.2355 10.8452 27.3875 17.3944 12.2282 56.8232 3.9460 59.0343 66.6046 16.8534 31.7093 67.0128 22.7813 118.1237 117.3508 56.5265 2.0135 1.9967 2.4573 1.8383 0.0297 0.0311 0.0169 0.0190
temp: 298.150 k
press: 1.00000 atm
elementType: 7 7 7 7 7 7 6 6 6 6 6 6 6 6 6 6 6 6 6 6 1 1 1 1 1 1 1 1 1 1 1 1 1 1 1 1 1 1 1 1 1 1 1 1 1 1 1 1 1 1 1 1 1 1 1 1
symmnumber: 1
zpe: 1334760.5 jmol-1
zpe.correction: 0.508383 hartree
zpe.thermalcorrener: 0.535634 hartree
zpe.thermalcorrenthalpy: 0.536578 hartree
zpe.thermalcorrgfe: 0.445927 hartree
zpe.sumelectzpe: -881.804045 hartree
zpe.sumelectthermal: -881.776795 hartree
zpe.sumelectthermalent: -881.775851 hartree
zpe.sumelectthermalfe: -881.866502 hartree
dipole: 0.0061 0.8488 0.0038
dipole: 0.8489
quadrupole: -132.1011 -141.7944 -123.7772
quadrupole: -0.0149 -8.3294 -0.0252
quadrupole: 0.4564 -9.2368 8.7803 -0.0149 -8.3294 -0.0252
hfenergy: -882.3124287 hartree
pointgroup: C01 [X(C14H36N6)]
dipole: 0.0044348 0.3339345 -0.0009965 debye
polarizability: 219.8895061|-0.2515488|197.2964061|-5.549877|-0.1224801|178.2931727 unknown
InChI: InChI=1S/C14H36N6/c15-5-1-9-19(10-2-6-16)13-14-20(11-3-7-17)12-4-8-18/h1-18H2
charge 0 multiplicity 1
56 atoms
N  -1.737099 -0.447308 -0.799659
N  1.734937 -0.451951 0.803926
N  -3.332527 3.705027 -0.465071
N  -5.116878 -1.62726 1.890984
N  3.357357 3.684932 0.40904
N  5.107697 -1.718408 -1.860976
C  -0.254762 -0.379586 -0.72798
C  0.253223 -0.370839 0.731595
C  -2.295112 0.292848 -1.965221
C  -2.251068 -1.842236 -0.699653
C  2.300812 0.300319 1.957943
C  2.234064 -1.853789 0.72668
C  -2.350361 1.820485 -1.747869
C  -3.670897 -1.938234 -0.100738
C  2.366719 1.824487 1.720073
C  3.65377 -1.975658 0.132421
C  -3.383355 2.241048 -0.683864
C  -3.723321 -1.563593 1.393441
C  3.396801 2.223243 0.644943
C  3.715198 -1.619725 -1.365905
H  0.092809 0.551068 -1.210666
H  0.22379 -1.218168 -1.292142
H  -0.233122 -1.196057 1.308639
H  -0.085265 0.570392 1.199951
H  -1.718292 0.070279 -2.897876
H  -3.324165 -0.074062 -2.143215
H  -2.234699 -2.347304 -1.698512
H  -1.558799 -2.414725 -0.052051
H  1.724654 0.09462 2.894919
H  3.327656 -0.07151 2.138406
H  2.210145 -2.34321 1.733247
H  1.536729 -2.428557 0.086595
H  -1.346908 2.189869 -1.449104
H  -2.598822 2.323903 -2.702191
H  -4.361229 -1.279058 -0.667398
H  -4.053655 -2.970293 -0.220399
H  1.364601 2.198342 1.422353
H  2.62465 2.33805 2.666446
H  4.352159 -1.319932 0.6932
H  4.02152 -3.011609 0.264793
H  -3.205284 1.631685 0.233127
H  -4.397996 1.99038 -1.052163
H  -3.2334 -0.570232 1.52307
H  -3.12529 -2.299175 1.96726
H  3.207855 1.604562 -0.26356
H  4.411474 1.968048 1.010018
H  3.246267 -0.618058 -1.508223
H  3.102486 -2.349532 -1.931564
H  -4.095869 4.069259 0.114621
H  -2.41998 4.030994 -0.127013
H  -5.203269 -1.532277 2.908287
H  -5.749465 -0.984247 1.401293
H  4.119849 4.035308 -0.180242
H  2.44543 4.014904 0.073169
H  5.196938 -1.636268 -2.879163
H  5.753198 -1.083392 -1.377717
