program: Gaussian 09
title: 000078525
version: EM64L-G09RevD.01
frameworkgroup: C1[X(C12H13NOS)]
method: RPBEPBE
basis: SDD
operation: Freq
keyword: #p
keyword: freq=noraman
keyword: PBEPBE/SDD
title: #p freq=noraman PBEPBE/SDD
converged: YES YES NO NO
title: Mulliken charges:
elementType: S O N C C C C C C C C C C C C H H H H H H H H H H H H H
charge: -0.043157 -0.263418 -0.135671 0.225173 0.408440 -0.373924 -0.389680 -0.338858 -0.293869 -0.545193 -0.116866 0.323356 -0.387908 -0.670651 -0.535132 0.262363 0.216559 0.245382 0.247724 0.259732 0.262699 0.246478 0.224198 0.258567 0.221256 0.221295 0.249145 0.221959
chargesum: 0.00000
title: Mulliken charges with hydrogens summed into heavy atoms:
elementType: S O N C C C C C C C C C C C C
charge: -0.043157 -0.263418 -0.135671 0.225173 0.408440 0.104997 -0.389680 -0.093476 -0.046144 -0.285462 0.145833 0.323356 -0.141430 0.033370 0.157267
polarizability: 2.94804838e+02 -1.16210079e+01 1.55175345e+02 -1.09656135e+00 -6.24902017e+00 7.61957728e+01
1716.lowfreq: -9.1227 -5.4605 -1.9938 0.0016 0.0024 0.0026 50.9367 69.5535 91.2041
frequency: 50.9348 69.5497 91.1981 103.8680 157.3130 180.0142 185.3581 213.4202 234.5943 270.1740 302.3802 335.0612 349.7077 380.7698 418.2100 438.5876 503.0535 506.9763 527.7773 547.7495 576.0120 604.4748 660.3056 708.8940 727.8080 756.1002 781.3866 798.7583 824.1389 863.5962 894.4909 899.3143 923.7955 956.6322 984.6705 1006.7104 1053.7934 1087.2909 1099.9005 1111.4172 1144.0197 1156.3445 1164.1921 1173.2434 1195.3719 1250.3062 1264.7743 1277.0270 1295.4298 1342.3161 1363.0983 1386.6272 1387.7682 1411.1270 1434.4067 1457.4466 1466.8467 1467.5997 1474.0387 1476.1374 1486.1997 1494.0489 1558.8313 1607.6544 1634.7927 2959.8094 2989.2090 3014.4239 3047.8692 3070.0686 3087.7822 3100.6348 3128.3201 3140.1931 3157.3257 3159.7076 3185.6640 3190.9086
redmass: 5.1672 3.2712 4.0804 3.1414 4.0313 4.0307 3.2727 1.0473 1.2623 4.4004 8.7402 3.6566 5.0487 3.2260 3.9215 3.7146 4.5754 3.4793 4.7202 4.2300 3.6852 4.8026 4.0341 5.7849 3.7452 3.1470 1.4278 1.5821 1.4136 2.8864 1.6514 5.0700 1.3512 2.5247 1.3295 4.0129 3.4732 2.1278 2.1859 1.2581 1.5052 1.8354 1.8221 1.7517 1.5083 1.6325 2.9177 1.5973 2.6965 1.7816 1.5064 1.4474 1.8273 5.9064 1.2777 2.2918 1.0443 1.0510 1.0996 1.1203 1.0617 3.0378 6.3007 7.0463 6.8307 1.0332 1.0358 1.0610 1.1041 1.1007 1.0999 1.1016 1.0992 1.0907 1.0922 1.0879 1.0943 1.0960
irintensity: 0.0412 0.6733 9.7165 0.5273 0.8707 0.3384 1.4204 0.2436 0.4629 7.0206 3.0667 3.8111 0.6145 1.6880 3.5159 6.7718 3.8541 0.5293 8.9587 21.5323 0.4910 7.1628 8.1274 5.7118 0.3935 0.5004 6.5822 53.3153 6.2842 6.3357 47.6224 3.4280 0.8691 3.3037 0.8837 53.2161 72.7123 40.8027 52.1498 0.1318 2.5870 36.4239 54.6697 5.7992 56.7940 47.0378 203.8484 44.7450 5.0918 41.1303 1.5435 12.7116 30.5760 37.3571 18.2418 27.2065 16.9211 13.8290 36.1229 28.0794 19.9068 44.4137 188.6469 59.9743 12.2624 79.3838 24.4237 29.7269 48.5638 4.9027 34.6406 13.3357 25.4704 8.8499 4.4879 8.0224 8.2334 3.3643
temp: 298.150 k
press: 1.00000 atm
elementType: 16 8 7 6 6 6 6 6 6 6 6 6 6 6 6 1 1 1 1 1 1 1 1 1 1 1 1 1
symmnumber: 1
zpe: 584900.6 jmol-1
zpe.correction: 0.222777 hartree
zpe.thermalcorrener: 0.236602 hartree
zpe.thermalcorrenthalpy: 0.237546 hartree
zpe.thermalcorrgfe: 0.182108 hartree
zpe.sumelectzpe: -992.028534 hartree
zpe.sumelectthermal: -992.014708 hartree
zpe.sumelectthermalent: -992.013764 hartree
zpe.sumelectthermalfe: -992.069202 hartree
dipole: -5.9782 2.6450 -0.1614
dipole: 6.5391
quadrupole: -102.9759 -83.9115 -99.7711
quadrupole: -2.8847 0.9010 -2.1633
quadrupole: -7.4231 11.6414 -4.2183 -2.8847 0.9010 -2.1633
hfenergy: -992.2513105 hartree
pointgroup: C01 [X(C12H13N1O1S1)]
dipole: -2.346045 1.0542415 -0.058553 debye
polarizability: 294.6808325|-12.3441511|155.4666083|-0.38378|-5.1784237|76.0285157 unknown
InChI: InChI=1S/C12H13NOS/c1-3-13-11-6-5-10(14-2)8-9(11)4-7-12(13)15/h4-8H,3H2,1-2H3
charge 0 multiplicity 1
28 atoms
S  4.289596 -0.409449 -0.066074
O  -3.934483 -0.476397 0.086952
N  1.659139 0.441012 -0.218135
C  0.25559 0.262756 -0.132511
C  -0.283204 -1.061771 0.043044
C  2.204638 1.809445 -0.445726
C  2.571336 -0.62282 -0.063979
C  -0.653792 1.352966 -0.20894
C  0.640595 -2.167655 0.152041
C  -1.685041 -1.2548 0.109267
C  1.999058 -1.946741 0.104327
C  -2.56916 -0.165108 0.013082
C  -2.044173 1.147337 -0.141505
C  2.385226 2.595407 0.867743
C  -4.891726 0.62764 -0.015999
H  3.190642 1.672724 -0.922853
H  1.544449 2.335246 -1.15585
H  -0.291427 2.37769 -0.310874
H  0.244921 -3.181102 0.281284
H  -2.09469 -2.26183 0.237552
H  2.718308 -2.763293 0.195609
H  -2.707984 2.014298 -0.204622
H  1.43277 2.719781 1.413005
H  3.100429 2.068011 1.521594
H  2.795707 3.597796 0.649453
H  -4.761692 1.354424 0.80955
H  -5.881533 0.155076 0.061359
H  -4.803499 1.148857 -0.989194
