program: Gaussian 09
title: 000078522
version: EM64L-G09RevD.01
frameworkgroup: C1[X(C7H8O2)]
method: RPBEPBE
basis: SDD
operation: Freq
keyword: #p
keyword: freq=noraman
keyword: PBEPBE/SDD
title: #p freq=noraman PBEPBE/SDD
converged: YES YES NO NO
title: Mulliken charges:
elementType: O O C C C C C C C H H H H H H H H
charge: -0.419674 -0.207647 -0.219728 -0.463190 -0.228728 -0.228444 -0.180046 -0.180032 0.180498 0.242648 0.216450 0.233090 0.227069 0.227217 0.213318 0.213344 0.373857
chargesum: 0.00000
title: Mulliken charges with hydrogens summed into heavy atoms:
elementType: O O C C C C C C C
charge: -0.045817 -0.207647 0.022919 -0.013650 -0.001660 -0.001227 0.033272 0.033312 0.180498
polarizability: 1.03765581e+02 6.12325104e-02 6.32952702e+01 -1.19077938e+01 -3.35776676e-02 5.83760704e+01
1716.lowfreq: -39.6245 -0.0001 0.0005 0.0010 3.7915 7.5051 26.2947 44.2213 171.3495
frequency: -38.7869 44.1541 171.3443 214.6666 339.1263 394.3700 402.1050 544.2178 568.5160 600.1355 618.2081 673.9260 706.2384 743.6826 859.2493 885.0024 916.7966 941.3420 959.8757 961.8553 979.6397 989.0094 1037.8369 1078.6862 1168.7913 1183.2098 1207.5406 1222.5864 1309.6031 1310.3925 1339.6411 1364.6455 1392.2170 1445.2550 1665.7973 1668.8692 1704.8860 2945.5647 2976.4465 2997.6332 3102.9919 3104.7740 3132.8930 3138.3155 3502.8421
redmass: 6.4710 3.2836 4.0828 2.9392 6.5684 3.1702 2.8887 4.4564 6.4501 2.0238 1.3020 2.1896 1.9122 1.9179 4.5814 2.8975 3.3411 2.1117 3.0167 2.0303 1.3265 1.5038 2.5570 1.5283 1.0371 1.0927 1.0822 1.3316 1.6100 1.7578 1.4262 2.1226 1.4848 1.0881 7.1656 8.2124 6.7877 1.0610 1.0961 1.0827 1.0832 1.0849 1.0985 1.1008 1.0639
irintensity: 2.0304 1.3601 0.0335 1.0488 6.1608 0.6844 6.3902 24.2426 0.2544 25.7654 107.2130 76.5310 45.7659 7.5200 18.2012 25.4658 16.6482 19.8723 49.4460 1.8023 0.0344 9.5794 300.7235 0.0068 0.0735 0.0362 0.7478 1.0096 5.0867 51.4865 2.1993 1.5682 2.6237 16.0400 5.8803 188.1739 0.5052 36.0590 23.2680 12.9776 1.1918 9.7392 79.3150 2.4588 18.4384
temp: 298.150 k
press: 1.00000 atm
elementType: 8 8 6 6 6 6 6 6 6 1 1 1 1 1 1 1 1
symmnumber: 1
zpe: 349996.7 jmol-1
zpe.correction: 0.133307 hartree
zpe.thermalcorrener: 0.140708 hartree
zpe.thermalcorrenthalpy: 0.141652 hartree
zpe.thermalcorrgfe: 0.100747 hartree
zpe.sumelectzpe: -421.290662 hartree
zpe.sumelectthermal: -421.283261 hartree
zpe.sumelectthermalent: -421.282317 hartree
zpe.sumelectthermalfe: -421.323221 hartree
dipole: -0.5735 0.0196 -1.0816
dipole: 1.2244
quadrupole: -41.9125 -48.9217 -59.4992
quadrupole: 0.0337 -2.2059 0.1140
quadrupole: 8.1986 1.1895 -9.3881 0.0337 -2.2059 0.1140
hfenergy: -421.4239686 hartree
pointgroup: C01 [X(C7H8O2)]
dipole: -0.2293873 0.0053217 -0.4235795 debye
dipolederiv: -1.1513376 -0.0056855 0.5278467 -0.0059439 -0.3999977 0.0035455 0.370227 0.0024103 -0.4934587 -0.686447 -0.0001549 -0.1221792 -0.0021039 -0.2907108 0.0039378 -0.0221791 0.0064987 -0.9402125 -0.2586225 0.0009565 -0.0744121 0.003163 -0.0235298 0.0014133 -0.0411952 0.0005457 0.1626769 0.0138384 -0.0001093 0.1155539 -0.0001792 -0.0763881 -0.0001206 0.1579857 -0.0001184 0.1725707 -0.0078154 0.0714567 -0.0713389 0.1688791 0.1694241 0.0658665 -0.1044728 -0.0062985 -0.2426013 -0.0088921 -0.0715866 -0.0719159 -0.1712758 0.1704146 -0.0662747 -0.1063898 0.0067053 -0.2428095 0.0318037 -0.0506366 -0.1199426 -0.1093476 0.1495217 0.0357812 -0.1485057 0.0424775 -0.1473775 0.0324722 0.051087 -0.1198726 0.1106337 0.149002 -0.03521 -0.1485259 -0.0422693 -0.1477693 1.7023107 0.0055018 -0.2008821 0.0071179 0.1148425 -0.0091272 -0.0954243 -0.0103361 1.2561932 0.0237178 -0.0001236 0.0876769 -0.0001357 0.0361992 -0.0000532 0.0714091 -0.0001602 -0.0601659 -0.1490546 0.0002334 -0.06782 0.0001113 0.0282365 0.0000343 -0.1272302 0.0001403 0.0756702 0.0770255 -0.0000043 0.043382 -0.0001177 0.0400699 -0.0000769 0.1084222 -0.0001059 -0.1215606 0.0405033 0.0761812 0.054731 0.040059 -0.1055866 -0.0446154 0.0560505 -0.0384731 0.1369433 0.0403381 -0.0764104 0.0548216 -0.0402815 -0.1052837 0.0442836 0.0561374 0.0384569 0.1369648 0.0314854 -0.0873725 0.0348178 -0.0864858 -0.1227631 0.0117873 0.0606101 0.0151149 0.1510783 0.0318727 0.087006 0.0347981 0.0859839 -0.1230996 -0.0119836 0.0609115 -0.0153818 0.1512614 0.2368016 -0.0003389 -0.1052646 -0.000077 0.3896488 0.0008119 -0.1478307 0.0007937 0.1525965 unknown
polarizability: 103.5517985|0.0205719|63.2947864|-12.3067311|-0.0666603|58.5903369 unknown
InChI: InChI=1S/C7H8O2/c8-7(9)6-4-2-1-3-5-6/h2-6,8H,1H2
charge 0 multiplicity 1
17 atoms
O  2.838336 0.008757 -0.51905
O  1.648731 -0.010688 1.476414
C  0.419085 -0.001757 -0.701147
C  -2.404689 0.001178 0.407263
C  -0.399136 -1.266971 -0.472575
C  -0.396419 1.265333 -0.472191
C  -1.658984 -1.260463 0.027566
C  -1.656236 1.261345 0.028103
C  1.645244 -0.00238 0.229687
H  0.823517 -0.001651 -1.732057
H  -3.409528 0.002416 -0.06653
H  -2.605043 0.001149 1.501085
H  0.087845 -2.216268 -0.730761
H  0.092596 2.213573 -0.730415
H  -2.187277 -2.213456 0.165783
H  -2.182487 2.215446 0.16649
H  3.615344 0.009238 0.104735
