program: Gaussian 09
title: 000078544
version: EM64L-G09RevD.01
frameworkgroup: C1[X(C15H9NO4)]
method: RPBEPBE
basis: SDD
operation: Freq
keyword: #p
keyword: freq=noraman
keyword: PBEPBE/SDD
title: #p freq=noraman PBEPBE/SDD
converged: YES YES NO NO
title: Mulliken charges:
elementType: O O O O N C C C C C C C C C C C C C C C H H H H H H H H H
charge: -0.202138 -0.192885 -0.425269 -0.305952 -0.668191 0.295829 0.336039 0.276585 0.262806 -0.219537 -0.227593 -0.488037 -0.607292 0.098241 0.367564 -0.375785 -0.372064 -0.225669 -0.228111 0.134621 0.323932 0.287297 0.292617 0.289339 0.240315 0.240456 0.380718 0.320441 0.391724
chargesum: 0.00000
title: Mulliken charges with hydrogens summed into heavy atoms:
elementType: O O O O N C C C C C C C C C C C C C C C
charge: -0.202138 -0.192885 -0.033545 -0.305952 0.032969 0.295829 0.336039 0.276585 0.262806 -0.219537 -0.227593 -0.164105 -0.319996 0.098241 0.367564 -0.083168 -0.082725 0.014646 0.012345 0.134621
polarizability: 3.35175584e+02 1.69333704e+01 2.15107089e+02 -3.49257969e-03 2.72953464e-04 6.80808028e+01
1716.lowfreq: -10.4840 -3.9205 -0.0011 0.0006 0.0007 5.3647 40.7616 54.2634 92.8883
frequency: 40.7570 54.2618 92.8882 121.2125 131.9918 132.3866 184.3508 212.9756 230.3206 277.6715 298.1437 312.7214 339.3325 371.9941 408.9936 416.0308 442.5481 451.4008 458.0126 480.4175 497.0877 531.4557 571.4896 589.1216 604.2800 627.5176 658.4077 671.4411 681.6446 712.4494 721.3783 729.9782 746.6647 757.4643 795.5397 809.2349 862.6310 866.9032 922.1376 952.2128 952.4079 991.0058 999.6532 1004.8342 1016.6041 1033.8017 1072.1577 1075.1735 1105.6550 1144.2331 1169.6208 1182.3547 1224.7822 1259.7837 1273.9883 1288.3419 1326.4870 1360.6219 1394.1797 1407.1055 1438.8719 1459.7566 1468.8937 1490.6900 1526.3482 1539.7082 1555.5533 1574.4878 1595.3061 1607.3011 1629.4858 1645.6442 3136.6449 3141.1770 3151.5104 3162.4350 3171.7634 3174.1123 3392.8957 3535.9791 3637.5649
redmass: 7.8103 7.1008 11.9442 4.9679 6.9633 7.3016 6.0032 5.2933 6.2102 7.2736 8.1951 5.9406 5.2423 10.9590 6.8817 3.4426 3.7817 3.5393 11.5483 8.2005 4.7516 1.1503 2.3070 1.7419 7.3184 5.4892 5.7315 4.6969 6.2222 6.4320 4.5773 2.4819 1.4504 5.7741 2.3341 1.8145 6.8841 2.1780 1.4756 2.0807 4.8966 1.5934 1.4033 5.1357 1.3819 1.9831 1.5889 3.5722 1.9689 1.8481 1.1966 1.9875 1.8885 1.3908 2.5808 2.3012 3.8649 4.9006 9.4087 6.4902 2.6920 6.3978 2.6890 3.6795 5.9181 7.5051 6.6068 5.0870 8.5475 5.8496 1.7406 6.6560 1.0863 1.0915 1.0901 1.0946 1.1002 1.0920 1.0566 1.0642 1.0945
irintensity: 4.4996 0.5349 3.4510 0.0089 0.0175 0.2206 1.3001 0.0156 1.5463 0.1366 0.5500 6.9533 6.9647 21.8923 6.2276 18.6868 1.4387 12.5788 4.8430 10.2797 12.6922 63.2746 44.3004 116.5698 21.2864 32.9010 1.4587 43.8142 6.3224 2.0434 0.4896 85.0275 66.2865 11.9759 71.8392 40.2632 4.4545 1.1234 14.2113 16.3960 46.2043 4.4687 8.2527 227.2643 0.2093 2.1426 12.1193 67.2958 76.6306 122.4255 24.6397 14.6601 1.5523 4.5580 325.3365 80.2305 303.1433 193.0523 6.7315 33.9790 1.8282 31.2765 11.6215 39.0661 134.7986 206.2572 98.5870 316.7146 6.7209 71.0705 65.4780 373.0232 3.9237 4.5445 6.2397 1.5428 33.3367 4.3148 237.2323 73.8719 62.7761
temp: 298.150 k
press: 1.00000 atm
elementType: 8 8 8 8 7 6 6 6 6 6 6 6 6 6 6 6 6 6 6 6 1 1 1 1 1 1 1 1 1
symmnumber: 1
zpe: 544817.5 jmol-1
zpe.correction: 0.207510 hartree
zpe.thermalcorrener: 0.222886 hartree
zpe.thermalcorrenthalpy: 0.223830 hartree
zpe.thermalcorrgfe: 0.164818 hartree
zpe.sumelectzpe: -931.338734 hartree
zpe.sumelectthermal: -931.323358 hartree
zpe.sumelectthermalent: -931.322414 hartree
zpe.sumelectthermalfe: -931.381426 hartree
dipole: 0.4180 1.3465 0.0052
dipole: 1.4099
quadrupole: -86.8657 -114.6475 -116.7444
quadrupole: 4.5338 0.0445 -0.0093
quadrupole: 19.2202 -8.5616 -10.6586 4.5338 0.0445 -0.0093
hfenergy: -931.546244 hartree
pointgroup: C01 [X(C15H9N1O4)]
dipole: 0.1676111 -0.528779 -0.0006667 debye
polarizability: 335.3441832|-16.2253278|214.9042442|-2.7791733|-0.7142753|68.1150486 unknown
InChI: InChI=1S/C15H9NO4/c16-12-6-10-9(5-11(12)15(19)20)13(17)7-3-1-2-4-8(7)14(10)18/h1-6,19H,16H2
charge 0 multiplicity 1
29 atoms
O  -0.751958 2.684259 -0.030126
O  -1.37685 -2.81237 0.007766
O  4.097479 2.188938 -0.082739
O  5.174004 0.140639 -0.077483
N  3.658404 -2.070774 -0.048638
C  0.284914 0.505329 -0.028608
C  0.127541 -0.921042 -0.018719
C  -2.246872 0.786761 -0.003097
C  -2.413964 -0.630402 0.006799
C  -0.885039 1.416284 -0.021975
C  -1.237141 -1.54818 -0.000849
C  1.588652 1.039832 -0.045551
C  1.248205 -1.759606 -0.025086
C  2.73366 0.211821 -0.052486
C  2.574576 -1.22903 -0.04172
C  -3.388623 1.624353 0.004745
C  -3.718812 -1.185397 0.024432
C  -4.682132 1.064795 0.022272
C  -4.848171 -0.344094 0.032152
C  4.085469 0.794597 -0.071408
H  1.708163 2.126929 -0.053285
H  1.082949 -2.84291 -0.017088
H  -3.231072 2.707407 -0.003168
H  -3.816799 -2.275552 0.031725
H  -5.561071 1.718357 0.028275
H  -5.854317 -0.7763 0.045747
H  4.597987 -1.653503 -0.061304
H  3.526214 -3.07971 -0.041958
H  5.041401 2.501571 -0.096423
