program: Gaussian 09
title: 000078538
version: EM64L-G09RevD.01
frameworkgroup: C1[X(C10H12O3S)]
method: RPBEPBE
basis: SDD
operation: Freq
keyword: #p
keyword: freq=noraman
keyword: PBEPBE/SDD
title: #p freq=noraman PBEPBE/SDD
converged: YES YES NO NO
title: Mulliken charges:
elementType: S O O O C C C C C C C C C C H H H H H H H H H H H H
charge: 0.174424 -0.219025 -0.457015 -0.221002 -0.223474 0.157179 0.208068 -0.257650 -0.248131 -0.337177 -0.591811 0.103257 -0.647076 -0.539582 0.303469 0.257608 0.247193 0.259224 0.261684 0.230988 0.228847 0.223194 0.222855 0.257899 0.224214 0.381840
chargesum: 0.00000
title: Mulliken charges with hydrogens summed into heavy atoms:
elementType: S O O O C C C C C C C C C C
charge: 0.174424 -0.219025 -0.075175 -0.221002 -0.223474 0.157179 0.208068 0.045819 0.009478 -0.089984 -0.070903 0.103257 0.035953 0.165386
polarizability: 2.04913371e+02 -4.79303341e+00 1.44535209e+02 3.32278177e+00 1.48990619e+00 8.11980469e+01
1716.lowfreq: -0.0001 0.0017 0.0018 3.2355 6.7804 9.2998 21.1621 24.4278 52.4111
frequency: 20.8886 24.4032 52.3924 54.3841 104.8908 114.4615 158.2570 183.1543 185.7642 237.3015 244.2016 256.6233 316.3688 339.4011 367.1157 372.8578 410.4758 430.1140 537.3797 554.6575 582.8910 610.6680 618.3908 627.5353 695.0934 716.0693 768.1686 784.8883 822.0495 829.6036 942.7986 964.1315 972.5907 978.7580 993.2219 1028.0458 1066.9836 1096.1851 1108.8239 1123.6809 1146.4937 1169.2450 1233.7006 1237.4178 1264.7457 1271.3417 1294.4418 1360.4698 1386.3727 1395.4464 1433.9463 1459.6535 1464.5406 1470.2702 1472.6773 1479.2889 1483.4792 1566.3207 1590.6585 1651.0584 2966.4936 2985.4629 3022.4185 3058.9904 3077.9573 3080.3364 3106.2533 3136.1676 3148.2805 3174.3314 3182.5495 3534.1745
redmass: 4.6309 9.6645 2.1044 2.9307 3.7174 4.1179 8.2504 4.3438 4.7254 1.1130 1.1602 3.8411 4.8130 5.5965 5.9163 7.8535 7.7043 3.1417 2.9323 4.0998 1.3292 5.1701 4.4785 7.0727 5.1571 5.3703 4.1247 1.1113 1.5648 7.5514 1.4417 1.3595 7.3681 5.5985 1.7921 1.1899 2.2958 2.0615 1.2591 2.0751 1.4984 1.3480 1.2533 3.7186 1.4641 1.2541 2.0691 4.7603 6.3934 1.2056 1.2177 1.0924 1.2673 1.0394 1.0552 1.7418 1.0491 8.1243 6.6447 8.7048 1.0328 1.0354 1.0574 1.1044 1.1027 1.0988 1.1070 1.0996 1.0891 1.0945 1.0924 1.0642
irintensity: 0.8454 1.6599 0.6692 0.4508 3.8063 3.9488 1.4962 2.9709 0.7307 0.0924 0.0539 0.9103 0.4836 0.5610 10.4638 0.5064 5.3112 9.3559 1.5543 21.1319 147.9117 26.0401 14.3585 11.6680 9.5995 4.9358 6.0668 8.9658 48.1640 2.3861 5.8626 2.4287 197.0034 137.0166 23.3009 1.3482 8.5353 26.4466 0.1786 59.8060 40.9494 46.5869 0.1434 149.6275 38.3403 23.8997 69.6864 14.4966 1.1807 18.9103 15.6986 2.9685 128.9287 15.1932 16.4177 47.2846 8.4085 45.8871 6.1985 358.2020 64.6537 36.3185 17.2200 42.2524 3.8883 25.9456 40.5491 16.8974 2.4531 9.5186 3.1412 40.3930
temp: 298.150 k
press: 1.00000 atm
elementType: 16 8 8 8 6 6 6 6 6 6 6 6 6 6 1 1 1 1 1 1 1 1 1 1 1 1
symmnumber: 1
zpe: 523968.3 jmol-1
zpe.correction: 0.199569 hartree
zpe.thermalcorrener: 0.214645 hartree
zpe.thermalcorrenthalpy: 0.215589 hartree
zpe.thermalcorrgfe: 0.154867 hartree
zpe.sumelectzpe: -1010.935353 hartree
zpe.sumelectthermal: -1010.920277 hartree
zpe.sumelectthermalent: -1010.919333 hartree
zpe.sumelectthermalfe: -1010.980055 hartree
dipole: -0.6190 -2.4229 1.6863
dipole: 3.0162
quadrupole: -88.9485 -74.7946 -91.9323
quadrupole: -12.3828 -5.4135 -1.5487
quadrupole: -3.7233 10.4305 -6.7072 -12.3828 -5.4135 -1.5487
hfenergy: -1011.1349221 hartree
pointgroup: C01[X(C10H12O3S1)]
dipole: 0.245798 0.9077686 0.7236661 debye
dipolederiv: -0.1820334 0.0391755 -0.1084697 0.1391301 -0.1858933 -0.0207012 -0.2034604 -0.0141514 -0.0511455 -1.5710553 0.6729455 0.225506 0.3386183 -0.3951782 -0.0591035 0.2657263 -0.1305784 -0.3097605 -0.4522516 0.4551794 0.0473951 0.2812309 -1.1822353 -0.1248367 0.0302046 -0.1166554 -0.4432303 -1.0114515 -0.1877455 0.0526664 -0.326096 -0.6849389 -0.0060371 0.0688099 -0.0005063 -0.3181197 0.4868886 -0.060436 -0.0276659 -0.0767338 -0.4078311 0.0129412 -0.0041348 0.0003325 -0.1952153 -0.4943859 -0.3671833 0.0057088 -0.0958128 -0.6038487 -0.0535352 0.0654094 0.0055728 -0.0272827 1.4332886 -0.5532927 -0.2405292 0.1546059 0.1455293 -0.0126202 -0.2242784 0.0968036 0.1573179 0.0169888 0.3289654 0.00405 0.0803124 0.1202648 0.0275803 0.0414266 -0.0372483 -0.0656508 0.0213988 -0.1612954 -0.0579279 -0.0854937 0.2277161 0.0236384 -0.0539503 0.0617457 -0.0688359 -0.531755 0.1224385 0.0373857 -0.3022328 0.0535036 0.0672934 0.0116808 0.0048874 -0.1939127 0.0959519 -0.0626584 0.2051238 -0.155098 0.1662304 -0.0617123 0.3539053 -0.0541421 0.2751479 1.3323011 0.156116 -0.1054875 0.2995486 1.926573 0.1530552 -0.1300783 0.1144911 0.2540015 -0.0972474 0.027719 0.0022489 0.0993289 0.0588824 0.0240873 -0.2400846 0.0445474 -0.0066704 0.5267318 -0.2262454 -0.0444907 -0.5039606 0.5527822 0.0869816 -0.0831866 0.0635685 0.3325284 0.1143504 0.0691261 0.0211026 0.0630088 0.077011 -0.0081079 0.015121 -0.0139141 0.1367283 0.0600802 -0.0876682 0.0123058 -0.0799575 0.0020812 -0.0074643 0.0114215 -0.0055292 0.1346782 0.0268458 0.0823054 0.02429 0.0773034 -0.0420621 -0.0291973 0.0311658 -0.0332046 0.159084 0.0192812 0.0649736 0.0156859 0.0626408 -0.0154773 -0.0740658 -0.0338125 -0.0477211 -0.1180697 -0.0171948 -0.083681 -0.0065058 -0.0725731 -0.0616456 0.0787545 -0.0240397 0.0538109 -0.0142341 0.0831222 0.0166169 0.0166089 0.0419919 -0.0060072 -0.1080785 0.1029976 -0.1316631 -0.0096456 0.0380914 -0.0627208 0.0132382 -0.1392351 -0.0801819 0.0337609 0.0750635 0.0406252 0.1016971 -0.048835 0.0474459 -0.0922116 0.0649308 0.0850077 0.0809595 -0.1126678 0.0808085 -0.0830493 0.0447726 -0.0548516 -0.1090501 0.1102256 -0.0540994 -0.10036 -0.0287914 -0.0984197 -0.0783182 -0.1222533 0.0156506 0.0415436 -0.0472607 0.0870855 0.0043138 0.0390366 -0.0067749 0.1195116 0.0809603 -0.0335766 0.0544141 0.134428 -0.0884095 0.0685627 0.0028505 0.1140305 -0.0758291 0.1474096 -0.1573028 0.0130648 -0.0628503 0.3051415 0.0038916 0.0236651 0.0092844 0.3882751 unknown
polarizability: 204.8899274|-4.7596651|144.4930622|-3.5184001|2.6012932|81.2636366 unknown
InChI: InChI=1S/C10H12O3S/c1-3-14-7-4-5-9(13-2)8(6-7)10(11)12/h4-6,11H,3H2,1-2H3
charge 0 multiplicity 1
26 atoms
S  3.089727 0.458996 -0.86502
O  -2.880283 0.740424 0.24783
O  -0.848267 -2.950961 -0.427189
O  -2.92146 -1.980699 -0.075451
C  1.286648 0.551946 -0.494043
C  -0.90264 -0.562092 -0.227096
C  -1.514155 0.716866 0.003224
C  0.494383 -0.612648 -0.479588
C  0.6723 1.805385 -0.267347
C  -0.712986 1.889823 -0.0259
C  3.732313 -0.192124 0.815193
C  -1.688216 -1.82473 -0.225097
C  5.249889 -0.397551 0.719821
C  -3.525183 2.039264 0.480863
H  0.945348 -1.588119 -0.676631
H  1.281388 2.715155 -0.282857
H  -1.163687 2.871368 0.143161
H  3.464572 0.552961 1.582783
H  3.203334 -1.136517 1.026283
H  5.505277 -1.132528 -0.064109
H  5.769224 0.54934 0.487353
H  5.641643 -0.77398 1.682837
H  -3.113975 2.536641 1.38012
H  -4.584644 1.794847 0.64079
H  -3.421127 2.702991 -0.398594
H  -1.427722 -3.759058 -0.427536
