program: Gaussian 09
title: 000078515
version: EM64L-G09RevD.01
frameworkgroup: C1[X(C8H6O2)]
method: RPBEPBE
basis: SDD
operation: Freq
keyword: #p
keyword: freq=noraman
keyword: PBEPBE/SDD
title: #p freq=noraman PBEPBE/SDD
converged: NO YES NO NO
title: Mulliken charges:
elementType: O O C C C C C C C C H H H H H H
charge: -0.217353 -0.414362 0.299986 0.080571 0.208373 -0.432268 -0.371136 -0.376955 -0.196579 -0.155670 0.245628 0.263284 0.220595 0.223706 0.262202 0.359977
chargesum: 0.00000
title: Mulliken charges with hydrogens summed into heavy atoms:
elementType: O O C C C C C C C C
charge: -0.217353 -0.054385 0.299986 0.080571 0.208373 -0.186640 -0.107852 -0.156360 0.027127 0.106532
polarizability: 1.23557404e+02 3.33748200e+00 1.02692584e+02 1.88953574e-03 1.78501889e-03 3.68875370e+01
1716.lowfreq: -7.6881 -0.0007 0.0003 0.0008 8.5979 9.9559 174.4699 203.2869 262.4975
frequency: 174.4697 203.2867 262.4973 283.7509 350.6064 465.6266 489.8937 532.2988 557.6433 587.4660 605.1376 652.7592 723.0847 752.3177 787.1405 816.3213 848.7821 855.8789 870.0545 952.2339 992.5394 1015.5826 1052.7080 1111.1677 1145.6430 1167.2662 1218.1959 1244.0016 1271.8027 1334.7007 1415.7065 1437.6778 1467.2553 1530.8604 1597.0087 1647.8515 3118.3469 3144.3948 3168.1059 3222.9484 3264.1821 3576.5283
redmass: 6.1453 4.0038 6.0021 3.8375 1.1443 4.3212 8.2505 4.0979 4.0295 5.6759 3.8858 6.5574 2.0104 1.2776 2.0682 5.7067 1.3381 6.8279 1.4427 1.3069 3.4362 2.7442 2.2677 1.4666 2.0270 1.2153 1.9069 1.5429 2.0943 2.5147 4.0006 4.8002 3.2065 4.5826 7.4058 7.6210 1.0883 1.0902 1.0985 1.0924 1.1073 1.0661
irintensity: 0.5381 21.4746 10.8860 5.9618 126.8248 0.7032 0.7932 0.3647 0.7598 0.9575 1.9942 1.2641 74.3365 2.3664 92.9342 9.6576 0.6831 25.7031 14.3775 1.9437 0.6909 145.5589 12.9566 3.6226 79.5398 21.8660 27.1548 22.9837 66.3472 11.0759 4.7425 15.1252 48.9147 0.3101 45.4361 28.1941 12.3279 11.2589 17.2619 1.8109 0.7097 40.9698
temp: 298.150 k
press: 1.00000 atm
elementType: 8 8 6 6 6 6 6 6 6 6 1 1 1 1 1 1
symmnumber: 1
zpe: 310525.0 jmol-1
zpe.correction: 0.118273 hartree
zpe.thermalcorrener: 0.125694 hartree
zpe.thermalcorrenthalpy: 0.126638 hartree
zpe.thermalcorrgfe: 0.086480 hartree
zpe.sumelectzpe: -458.174930 hartree
zpe.sumelectthermal: -458.167509 hartree
zpe.sumelectthermalent: -458.166565 hartree
zpe.sumelectthermalfe: -458.206723 hartree
dipole: 1.0749 1.5175 0.0000
dipole: 1.8596
quadrupole: -39.7377 -56.5917 -61.9367
quadrupole: -3.8457 0.0003 0.0003
quadrupole: 13.0177 -3.8363 -9.1813 -3.8457 0.0003 0.0003
hfenergy: -458.293203 hartree
pointgroup: C01 [X(C8H6O2)]
dipole: 0.4567252 0.5715502 -0.0000112 debye
dipolederiv: -0.6211555 0.1364082 -0.0000054 -0.1717106 -0.5785438 -0.0000119 -0.0000031 0.000008 -0.1156545 -0.220165 0.3736567 -0.0000028 0.4829476 -1.2717527 -0.0000256 -0.0000063 -0.0000017 -0.4020446 0.278651 0.1477299 0.000003 -0.0119189 -0.0190386 -0.0000016 0.0000103 0.0000016 0.0556758 0.1722007 0.3476158 0.0000021 0.4359485 0.01603 0.0000009 0.0000053 -0.0000049 0.0001027 0.3637194 -0.3913852 0.0000008 -0.482328 1.2297759 0.0000355 -0.0000049 0.0000169 0.0882445 -0.131899 -0.060605 0.0000033 0.009819 0.0033032 0.0000045 0.0000002 0.0000192 -0.2171574 -0.0674547 -0.1867346 0.0000019 -0.0530923 -0.1416786 0.0000035 0.0000023 -0.0000057 -0.2377108 -0.0866714 -0.1816111 0.0000067 0.1018581 -0.31155 -0.0000018 0.0000142 -0.0000066 -0.2414372 0.0962403 0.042793 0.0000096 -0.0484882 0.1342944 0.0000059 0.0000033 0.0000065 -0.1422771 0.139524 -0.2047782 0.0000081 -0.1928643 0.4993904 0.0000073 -0.0000029 -0.0000012 -0.1136611 0.065564 0.0607362 -0.0000015 0.0299863 -0.0791925 -0.0000041 -0.0000022 -0.0000127 0.1800676 0.0344972 0.0525573 -0.0000032 0.0952241 0.0394648 -0.0000008 -0.0000038 0.0000001 0.1992849 -0.1000552 0.0721062 -0.0000093 0.0878874 0.0452978 -0.0000028 -0.0000089 -0.0000044 0.1823182 -0.0265885 -0.1134344 -0.0000112 -0.1052693 -0.0193487 -0.0000078 -0.0000057 -0.0000068 0.1618 0.0171596 -0.027544 -0.0000065 -0.045525 0.0842291 -0.0000037 -0.0000016 -0.0000028 0.2134196 0.086433 -0.0675108 0.0000045 -0.1324745 0.3693193 0.0000026 0.0000038 -0.0000056 0.3890294 unknown
polarizability: 123.8731508|2.1097602|102.3768376|0.0019897|0.0016727|36.887537 unknown
InChI: InChI=1S/C8H6O2/c9-7-3-1-2-6-4-5-10-8(6)7/h1-5,9H
charge 0 multiplicity 1
16 atoms
O  -1.33138 -1.33238 0.000068
O  1.449461 -2.232262 0.00006
C  -0.627954 0.886565 0.000109
C  -0.211606 -0.476277 0.000084
C  1.141974 -0.866162 0.000086
C  0.348204 1.918046 0.000127
C  -2.084554 0.853305 0.000085
C  2.102069 0.172599 0.000158
C  1.704599 1.53949 0.00019
C  -2.455932 -0.474419 0.000037
H  0.057807 2.9728 0.00014
H  -2.758934 1.707316 0.000084
H  3.170106 -0.081442 0.000197
H  2.484043 2.309152 0.000244
H  -3.418314 -0.979525 -0.000003
H  2.430111 -2.367305 0.000033
