program: Gaussian 09
title: 000078530
version: EM64L-G09RevD.01
frameworkgroup: C1[X(C16H10O3)]
method: RPBEPBE
basis: SDD
operation: Freq
keyword: #pfreq=noraman
keyword: PBEPBE/SDD
title: #p freq=noraman PBEPBE/SDD
converged: NO YES NO NO
title: Mulliken charges:
elementType: O O O C C C C C C C C C C C C C C C C H H H H H H H H H H
charge: -0.212794 -0.130208 -0.130209 0.034136 0.034121 0.353925 0.353910 0.113908 0.113916 -0.384582 -0.384579 -0.384783 -0.384784 -0.219229 -0.219240 -0.219368 -0.219375 -0.235651 -0.235627 0.237182 0.237182 0.237476 0.237476 0.234000 0.234003 0.234012 0.234015 0.235587 0.235581
chargesum: 0.00000
title: Mulliken charges with hydrogens summed into heavy atoms:
elementType: O O O C C C C C C C C C C C C C C C C
charge: -0.212794 -0.130208 -0.130209 0.034136 0.034121 0.353925 0.353910 0.113908 0.113916 -0.147400 -0.147398 -0.147307 -0.147309 0.014771 0.014763 0.014644 0.014640 -0.000063 -0.000046
polarizability: 2.00559677e+02 6.55645416e-04 1.66058754e+02 4.33429585e-01 7.50993543e-04 1.47577026e+02
1716.lowfreq: -58.0638 -50.3593 -5.2459 -4.9828 -0.0003 0.0004 0.0006 2.4427 41.0361
frequency: -58.0620 -50.3233 41.0354 49.1037 85.1672 89.7255 162.8579 166.2755 221.2249 223.0185 275.1713 307.1888 392.2513 392.9083 415.7283 429.3729 471.3972 509.1824 530.0071 606.2593 614.4075 614.4517 617.5250 665.3980 665.9264 700.3371 701.6007 701.7438 760.7479 761.8786 763.8274 766.4817 846.3802 851.0155 856.5880 892.2841 923.8679 925.5168 972.5333 974.8888 987.3850 988.7801 998.1534 998.8844 1021.6678 1028.1334 1074.5355 1081.4132 1082.3327 1109.5937 1175.8480 1176.0305 1190.0720 1192.2298 1225.5753 1313.5795 1314.4224 1333.5047 1370.5661 1371.8497 1428.8524 1430.3856 1474.0386 1487.3898 1584.3634 1585.8752 1604.5191 1613.2444 1661.6224 1678.9535 1739.6511 3129.9744 3130.4546 3133.8728 3135.2190 3144.9780 3145.8549 3155.7883 3156.4486 3170.5282 3170.8652
redmass: 4.1191 3.8971 5.5948 7.9967 5.7680 6.7433 15.2674 5.4912 5.8838 4.4424 9.2949 7.0333 2.8072 2.8158 9.9720 7.8649 4.1789 3.7315 8.8342 11.8047 6.5204 6.5864 8.0536 5.4410 7.2098 1.5891 1.7939 11.1014 1.8171 2.5222 11.1228 10.9083 1.2492 1.2462 4.3369 5.6324 1.5853 1.5174 1.3927 1.3881 6.1593 6.1088 1.3345 1.3305 2.8445 2.2771 3.4897 1.6214 1.6010 6.7941 1.0524 1.0524 1.1120 1.1220 4.6929 1.3833 1.3620 4.1401 6.1905 7.0411 2.2196 2.2140 2.2183 2.5985 5.8839 5.9917 6.3196 6.2099 10.9409 13.1297 13.0358 1.0850 1.0850 1.0882 1.0881 1.0926 1.0927 1.0969 1.0970 1.1019 1.1019
irintensity: 0.0002 0.0530 0.4234 0.0001 1.7788 0.0158 1.0585 0.0001 5.2950 0.2256 3.6741 0.0155 0.0010 0.0933 3.7667 2.7950 19.1291 10.6032 0.0147 2.4424 1.1259 0.0006 39.7129 5.0628 3.6938 67.6272 39.8993 14.9240 50.6557 55.8778 121.5377 0.1277 0.0006 0.6341 9.9040 26.8163 1.9406 0.3765 0.0000 0.1414 5.5156 2.7098 0.0022 0.0071 12.4586 0.7617 0.4675 18.4945 0.0015 178.5906 0.0000 0.0128 2.5621 0.0373 21.6857 1.3313 0.0002 40.6282 0.0608 0.0000 18.3929 0.0030 17.5625 0.0421 3.5706 0.0002 5.0762 1.7548 28.7708 491.6747 79.2269 1.7257 0.8888 0.0002 0.0055 11.7100 13.5868 0.0178 55.0195 19.0092 15.5977
temp: 298.150 k
press: 1.00000 atm
elementType: 8 8 8 6 6 6 6 6 6 6 6 6 6 6 6 6 6 6 6 1 1 1 1 1 1 1 1 1 1
symmnumber: 1
zpe: 554724.6 jmol-1
zpe.correction: 0.211283 hartree
zpe.thermalcorrener: 0.224847 hartree
zpe.thermalcorrenthalpy: 0.225791 hartree
zpe.thermalcorrgfe: 0.169908 hartree
zpe.sumelectzpe: -840.077919 hartree
zpe.sumelectthermal: -840.064356 hartree
zpe.sumelectthermalent: -840.063412 hartree
zpe.sumelectthermalfe: -840.119294 hartree
dipole: 0.0000 -6.5385 0.0001
dipole: 6.5385
quadrupole: -111.2364 -122.6923 -93.5081
quadrupole: 0.0000 0.1590 0.0007
quadrupole: -2.0908 -13.5467 15.6375 0.0000 0.1590 0.0007
hfenergy: -840.2892025 hartree
pointgroup: C01 [X(C16H10O3)]
dipole: -0.0127831 -2.5724225 0.0000805 debye
polarizability: 200.5551808|-0.1719102|166.059611|0.6169552|-0.0047648|147.5806647 unknown
InChI: InChI=1S/C16H10O3/c17-15-13(11-7-3-1-4-8-11)14(16(18)19-15)12-9-5-2-6-10-12/h1-10H
charge 0 multiplicity 1
29 atoms
O  0.015227 3.228193 -0.000126
O  2.326967 2.808347 0.003986
O  -2.300585 2.8314 -0.004251
C  0.689213 0.932403 0.001377
C  -0.681564 0.939241 -0.001475
C  1.628969 -0.217209 0.003802
C  -1.632768 -0.200955 -0.003784
C  1.17745 2.359958 -0.000169
C  -1.155587 2.371589 -0.000109
C  2.086413 -0.769107 -1.219971
C  -2.095603 -0.748225 1.220056
C  2.09774 -0.754569 1.229756
C  -2.106865 -0.733756 -1.229699
C  2.994952 -1.84987 -1.215502
C  -3.014839 -1.819931 1.215695
C  3.0061 -1.835496 1.2297
C  -3.025916 -1.80563 -1.229535
C  3.456889 -2.385765 0.008208
C  -3.482072 -2.351297 -0.007976
H  1.735371 -0.352043 -2.170388
H  -1.740427 -0.334597 2.170437
H  1.755642 -0.326207 2.178411
H  -1.760579 -0.30888 -2.178398
H  3.342132 -2.270324 -2.165365
H  -3.36617 -2.236865 2.165581
H  3.36192 -2.2448 2.181238
H  -3.385834 -2.211472 -2.181012
H  4.163561 -3.222634 0.009909
H  -4.197035 -3.181098 -0.009595
