program: Gaussian 09
title: 000078536
version: EM64L-G09RevD.01
frameworkgroup: C1[X(C9H13NO2S)]
method: RPBEPBE
basis: SDD
operation: Freq
keyword: #p
keyword: freq=noraman
keyword: PBEPBE/SDD
title: #p freq=noraman PBEPBE/SDD
converged: YES YES NO NO
title: Mulliken charges:
elementType: S O O N C C C C C C C C C H H H H H H H H H H H H H
charge: 0.212817 -0.368506 -0.272358 -0.599775 0.415693 0.126192 -0.276084 -0.260343 -0.765728 0.214684 -0.754275 -0.203630 -0.689582 0.245662 0.246337 0.199439 0.236214 0.231621 0.236150 0.227353 0.229673 0.389508 0.310809 0.220137 0.225038 0.222953
chargesum: 0.00000
title: Mulliken charges with hydrogens summed into heavy atoms:
elementType: S O O N C C C C C C C C C
charge: 0.212817 -0.368506 -0.272358 0.100543 0.415693 0.126192 -0.276084 -0.260343 -0.074290 0.214684 -0.050290 0.253395 -0.021454
polarizability: 1.81431738e+02 3.83348423e+00 1.46123822e+02 -3.66806976e-01 5.92288825e-02 6.99859598e+01
1716.lowfreq: -12.1082 -7.5502 0.0016 0.0017 0.0024 2.7553 24.9307 71.0430 76.7040
frequency: 24.6092 71.0217 76.6752 81.4233 106.2661 133.4181 142.9099 152.3822 229.3877 234.9059 262.6598 293.9756 304.2255 321.8062 335.5284 355.1102 365.6166 392.3136 465.9554 483.5314 531.9902 541.4204 608.5797 651.1746 665.5558 713.7196 737.9629 798.6287 801.4484 829.5354 909.2490 989.5042 1033.0232 1037.5666 1044.9701 1077.2570 1102.3667 1109.7272 1138.5778 1139.4908 1201.9604 1245.8134 1323.1562 1347.2427 1394.8147 1395.3247 1407.6775 1411.2097 1456.5365 1461.2166 1461.5804 1467.1041 1474.1522 1476.9893 1489.4407 1531.0874 1598.4905 1615.8104 1622.5743 2968.1061 2989.1404 2996.5527 3011.4408 3037.1532 3066.1453 3078.0159 3086.8371 3088.2224 3098.8237 3099.6125 3438.6278 3663.5457
redmass: 2.6245 2.3304 4.7118 1.1619 3.7491 2.9383 3.3897 1.0854 3.7957 2.5908 1.4417 3.8565 3.5430 4.7897 3.0967 1.2333 6.8298 3.7827 5.9137 7.0658 3.5255 5.7211 6.1572 1.2332 4.0990 6.0350 7.6903 1.2532 2.7652 3.2041 2.5619 2.0975 1.3926 3.2282 1.4673 2.1923 2.1669 2.1925 1.5557 2.9203 3.2261 1.1330 4.2764 1.5806 1.2898 1.2648 2.4802 1.5246 1.0437 1.0446 1.0772 1.0414 1.0859 1.0551 1.0759 2.3102 1.7751 8.3245 7.4350 1.0378 1.0355 1.0363 1.0582 1.0985 1.1055 1.0973 1.0984 1.0961 1.1035 1.0988 1.0523 1.0969
irintensity: 0.1687 2.8048 0.9890 0.1251 0.7620 0.0599 9.3578 0.0044 4.3567 6.8783 0.0940 5.3316 4.8376 0.5623 9.2176 124.1636 2.6244 1.9749 6.3317 0.6171 50.0658 2.4464 8.9287 86.4105 0.2134 2.0387 18.5885 11.3241 39.0660 3.0231 72.7764 145.0690 5.3687 204.9573 0.1969 15.8871 51.4112 5.1797 6.4060 24.0524 17.9810 0.0189 50.5265 30.7468 61.1292 2.9223 147.9917 57.6945 0.1296 22.4381 7.0822 12.3962 30.5748 6.8770 6.4956 23.8410 258.9696 305.8735 155.3591 58.0815 22.1146 24.5449 23.3501 22.8905 2.8438 13.2712 35.7331 13.4211 54.7809 33.6525 158.0760 88.7700
temp: 298.150 k
press: 1.00000 atm
elementType: 16 8 8 7 6 6 6 6 6 6 6 6 6 1 1 1 1 1 1 1 1 1 1 1 1 1
symmnumber: 1
zpe: 540113.2 jmol-1
zpe.correction: 0.205718 hartree
zpe.thermalcorrener: 0.220766 hartree
zpe.thermalcorrenthalpy: 0.221711 hartree
zpe.thermalcorrgfe: 0.163062 hartree
zpe.sumelectzpe: -953.036378 hartree
zpe.sumelectthermal: -953.021330 hartree
zpe.sumelectthermalent: -953.020386 hartree
zpe.sumelectthermalfe: -953.079034 hartree
dipole: 0.9990 -2.8021 0.0133
dipole: 2.9749
quadrupole: -68.4722 -82.4734 -87.4157
quadrupole: -7.2317 -0.0504 0.1516
quadrupole: 10.9815 -3.0196 -7.9619 -7.2317 -0.0504 0.1516
hfenergy: -953.242096 hartree
pointgroup: C01 [X(C9H13N1O2S1)]
dipole: -0.4275082 1.089229 0.0264728 debye
dipolederiv: -0.4879341 0.0980022 -0.0021641 -0.0324798 -0.2403231 -0.0050035 -0.004634 -0.0048511 0.0468525 -1.8673461 0.0488511 -0.0016319 0.4365273 -0.5175864 -0.0051517 0.0117667 -0.0052089 -0.3120282 -0.7658099 -0.2377132 -0.0083882 -0.1817445 -1.1965561 -0.0235286 -0.0052473 -0.0227211 -0.3118718 -0.8347957 0.6946044 0.0100476 0.3313119 -0.98718 -0.0048542 0.0039463 -0.0017992 -0.6000354 0.351334 0.0263853 0.0029808 -0.147355 0.0909579 0.0002258 -0.0015784 0.0002384 0.0002894 -0.8886405 -0.5216245 -0.0143609 -0.2424303 -0.9190725 -0.0173475 -0.0123946 -0.0188784 -0.1122912 -0.0292993 -0.2051265 -0.0016805 -0.2542549 0.3477663 0.0081676 -0.0012611 0.0089275 -0.2393876 0.9309308 -0.4169901 -0.0007793 0.030707 1.2060535 0.0213522 0.0090607 0.0190774 0.0216378 0.0783741 -0.0666344 -0.0007776 0.0095772 -0.1147016 -0.0030811 0.0004535 -0.003481 0.0638533 2.166416 0.4995522 0.0189696 -0.1484538 1.4644227 0.0321621 0.0087135 0.0323494 0.2435275 0.0135778 0.0244099 -0.0001922 0.0522939 -0.0505551 -0.0028418 -0.0003365 -0.0030987 0.1424133 1.0550336 0.0644471 0.0052371 0.1802612 0.2540802 0.0013116 0.0029565 0.0027941 0.3509999 -0.1302164 0.0829675 0.0066004 0.0491391 -0.0068966 -0.0098975 0.0041545 -0.0101433 0.0744383 0.0843926 -0.0590016 0.0845593 -0.0264791 0.0133916 0.0426475 0.0737902 0.0646534 -0.0272168 0.0883619 -0.0550844 -0.0839324 -0.0232912 0.0170999 -0.0415847 -0.0719437 -0.0639027 -0.0326199 -0.1708701 0.1516824 0.000075 0.0366736 0.0726046 -0.000022 -0.0019959 0.0010281 0.0980005 -0.0556936 -0.0213 -0.0643269 -0.0646023 0.0766427 -0.0870928 -0.1377979 -0.0642866 -0.0534005 0.0694018 0.0277159 -0.000043 0.1113317 -0.1119189 -0.0039798 0.001529 -0.0043322 0.1131152 -0.0579681 -0.0252442 0.0632144 -0.0723083 0.0701207 0.0912268 0.1343503 0.0689228 -0.0432334 -0.0639012 0.0113189 0.013637 -0.0705073 0.0045531 -0.0861799 -0.0357504 -0.0945653 -0.0767405 -0.0522984 0.0176206 -0.0157144 -0.0737431 -0.0150749 0.0901099 0.0252311 0.0948936 -0.0468627 0.3306141 0.0299118 -0.0006245 0.1765942 0.2540636 -0.0009814 0.0016878 -0.001555 0.3501403 0.1656294 -0.048156 -0.0019449 -0.063059 0.2421465 -0.0025034 -0.0027742 -0.0021992 0.3748642 -0.166309 -0.0651423 -0.001633 -0.0920234 0.0532833 -0.0024494 -0.0024724 -0.0027939 0.1148706 0.1186801 -0.0260677 -0.0450266 0.0380707 0.0112101 -0.101124 -0.0143592 -0.1058836 -0.0828574 0.1183364 -0.0293844 0.0378989 0.0402442 -0.0185315 0.1104199 0.0149053 0.1168157 -0.056457 unknown
polarizability: 181.1534493|4.9207833|146.3689289|0.7506528|1.5293479|70.0191413 unknown
InChI: InChI=1S/C9H13NO2S/c1-4-12-9(11)7-5(2)6(3)13-8(7)10/h4,10H2,1-3H3
charge 0 multiplicity 1
26 atoms
S  2.140614 1.877997 0.161976
O  -2.115414 0.163948 0.10558
O  -1.195154 -1.981534 0.056958
N  -0.575858 2.322482 0.149319
C  1.580349 -0.732767 0.111862
C  0.28239 -0.035525 0.11375
C  2.670253 0.114407 0.135063
C  0.411475 1.372344 0.140034
C  1.699882 -2.241681 0.088425
C  -0.996478 -0.737624 0.088939
C  4.149889 -0.150144 0.142896
C  -3.454405 -0.485767 0.080784
C  -4.496734 0.626577 0.169796
H  1.189912 -2.69207 0.957786
H  1.206472 -2.663723 -0.804295
H  2.754887 -2.562085 0.09361
H  4.638721 0.257974 1.048585
H  4.346259 -1.235115 0.121594
H  4.65471 0.295814 -0.735733
H  -3.542926 -1.069725 -0.853063
H  -3.5181 -1.189688 0.929714
H  -1.538636 1.970165 0.137846
H  -0.365448 3.316213 0.166577
H  -5.511221 0.188123 0.155919
H  -4.384712 1.2011 1.106103
H  -4.413227 1.321402 -0.684625
