program: Gaussian 09
title: 000078514
version: EM64L-G09RevD.01
frameworkgroup: C1[X(C10H12O2)]
method: RPBEPBE
basis: SDD
operation: Freq
keyword: #pfreq=noraman
keyword: PBEPBE/SDD
title: #p freq=noraman PBEPBE/SDD
converged: YES YES NO NO
title: Mulliken charges:
elementType: O O C C C C C C C C C C H H H H H H H H H H H H
charge: -0.339982 -0.435678 -0.417150 0.270387 0.510476 0.119657 -0.317329 -0.323249 -0.255919 -0.216387 -0.789204 -0.715242 0.229189 0.209901 0.245619 0.249849 0.223863 0.221907 0.241030 0.228786 0.227158 0.227715 0.228235 0.376370
chargesum: 0.00000
title: Mulliken charges with hydrogens summed into heavy atoms:
elementType: O O C C C C C C C C C C
charge: -0.339982 -0.059308 0.021939 0.270387 0.510476 0.119657 -0.071710 -0.073400 -0.032055 0.010771 -0.097482 -0.259292
polarizability: 1.61122249e+02 2.43111640e+00 1.12102591e+02 -1.19547117e+01 1.21067148e+00 7.05971572e+01
1716.lowfreq: -15.0519 -8.6612 -5.2452 -0.0007 -0.0003 0.0003 32.9278 37.4362 92.7449
frequency: 32.6346 37.2079 92.7391 109.3239 160.8727 185.8756 209.1595 271.3872 283.9757 391.3986 417.3383 441.8390 464.2496 492.2462 493.8554 551.6060 553.8731 593.5159 695.7539 707.5515 743.1786 767.4352 821.9667 832.6420 843.1579 907.8061 953.8630 958.4048 960.4774 966.5272 986.6019 1028.6349 1034.1850 1061.0197 1094.8509 1164.7450 1179.1950 1187.0215 1203.5130 1251.2375 1303.4956 1307.1254 1359.6179 1391.5719 1409.2878 1432.7167 1454.5195 1455.7322 1467.8306 1479.7148 1489.4658 1601.7338 1620.1041 1677.4263 2945.3195 2975.4281 3024.2372 3054.4556 3093.7970 3097.5325 3136.0245 3150.6478 3164.5029 3176.4654 3197.9094 3512.2792
redmass: 3.1404 4.0369 3.7890 2.7115 1.1274 5.1705 4.0296 4.7509 5.0239 2.2680 2.4846 3.0159 3.6809 1.1965 3.3252 4.6401 3.9188 5.4128 1.1927 4.3827 1.2281 4.9447 5.5310 1.4104 3.0008 1.3703 2.6695 1.3431 1.3032 1.6006 1.9066 2.0549 1.5109 1.6535 2.0907 1.1857 1.6675 1.7717 1.0950 2.4299 2.6315 1.4609 1.4622 1.2458 4.7197 1.1728 1.8603 1.2117 1.1265 1.0911 2.7635 7.1484 6.3060 5.1138 1.0589 1.0383 1.1030 1.0947 1.0640 1.0990 1.0851 1.0901 1.0947 1.0996 1.1142 1.0645
irintensity: 0.1244 0.0931 0.0850 3.3731 0.3926 0.7773 2.8948 3.8878 0.7375 4.7776 4.4234 12.3628 2.7940 116.2908 20.0945 4.9835 2.7352 3.0917 1.7316 0.6851 108.2752 23.0035 3.1168 0.6330 4.4699 3.7037 86.7947 25.0419 57.4965 2.1626 48.7588 27.2820 16.5708 2.8306 50.8111 31.2464 75.6350 171.1755 3.7463 145.9148 4.0090 25.7356 15.7084 27.7264 23.3416 7.3681 21.6382 10.0821 72.2684 9.4961 113.8204 23.3555 10.1793 15.5222 31.9603 20.6981 31.4411 19.5263 9.8811 24.6786 0.5872 21.8778 20.9184 9.1786 20.8921 72.1630
temp: 298.150 k
press: 1.00000 atm
elementType: 8 8 6 6 6 6 6 6 6 6 6 6 1 1 1 1 1 1 1 1 1 1 1 1
symmnumber: 1
zpe: 509081.7 jmol-1
zpe.correction: 0.193899 hartree
zpe.thermalcorrener: 0.205889 hartree
zpe.thermalcorrenthalpy: 0.206833 hartree
zpe.thermalcorrgfe: 0.154774 hartree
zpe.sumelectzpe: -537.782322 hartree
zpe.sumelectthermal: -537.770332 hartree
zpe.sumelectthermalent: -537.769388 hartree
zpe.sumelectthermalfe: -537.821447 hartree
dipole: 2.3301 -2.1203 0.5433
dipole: 3.1969
quadrupole: -63.7448 -70.9013 -74.2100
quadrupole: 3.3504 -0.1691 0.9103
quadrupole: 5.8738 -1.2826 -4.5913 3.3504 -0.1691 0.9103
hfenergy: -537.9762209 hartree
pointgroup: C01 [X(C10H12O2)]
dipole: 0.88265 -0.8679863 -0.2224498 debye
dipolederiv: -1.9535747 0.0977236 0.1828065 0.1761585 -0.360535 -0.0411102 0.1021231 -0.0312877 -0.2798011 -0.4334305 -0.4660834 -0.161627 -0.4454242 -1.0301894 -0.1727714 -0.1685807 -0.1764984 -0.4441944 0.9853744 -0.1480054 -0.1945785 -0.59094 0.4067924 0.005798 -0.2066517 -0.0051856 0.3046909 1.4555901 0.1041305 -0.0684471 0.0869463 -0.1669385 -0.0849239 -0.0642739 -0.0912086 0.0144433 0.1013752 0.0747483 0.026521 0.0937417 -0.0689792 0.0851157 -0.0111921 0.0569851 0.3421429 0.0182255 0.4243787 0.1505688 0.5917556 0.8893833 0.2345794 0.2096714 0.2518789 0.1147008 -0.1165861 0.0448534 0.009657 -0.1236856 -0.0213361 0.0654236 -0.0541673 0.0533461 -0.1502278 0.0071784 -0.2297116 -0.0906826 0.0507414 -0.0565547 0.0353725 0.0050823 0.0597359 -0.1547764 -0.0876398 -0.0243581 -0.0142343 0.0913383 -0.0084573 0.0579292 0.020493 0.0680051 -0.174188 0.0334053 0.0766669 0.0115104 -0.1198539 0.005373 0.0721433 -0.0546449 0.0572023 -0.1515374 -0.0308782 -0.0037969 0.0069508 -0.0722018 0.0457713 -0.0549434 -0.0103631 -0.0712208 -0.1558796 -0.1320522 0.1204911 0.1092607 0.1297096 -0.359101 0.0651441 0.0257372 0.0730745 -0.1387513 -0.0210896 -0.0082051 -0.0416895 0.0872068 0.0270134 -0.0452422 0.0030844 -0.0741391 -0.1347322 -0.0509559 -0.0546321 0.0618536 0.0950506 -0.0923016 0.0626755 0.0659931 0.112445 -0.019184 0.0194521 0.0973892 0.0451257 0.1092076 0.0102573 -0.0629861 0.0527773 -0.061356 0.1383044 0.0399701 0.0651116 0.0315343 0.0748783 -0.001141 -0.0640248 0.0337973 -0.0626922 0.1479334 0.0334971 -0.0694843 -0.0136158 -0.0891047 -0.0645338 -0.0738656 -0.0201314 -0.0767817 0.14412 0.1236782 -0.0530308 0.0032909 -0.0163193 -0.0495815 0.1325152 0.0258585 0.0795142 -0.0380465 0.0684493 0.1165377 0.0362235 0.1145318 -0.0030762 -0.0818665 0.0693413 -0.0349719 0.048255 -0.1528597 -0.0863255 -0.0541741 -0.0735164 0.0872579 -0.0207509 0.0144645 0.0012508 0.0713316 -0.1332115 -0.027825 0.0123169 -0.024552 0.0955266 -0.0224165 0.013436 -0.0230871 0.157393 0.0815212 -0.0525168 -0.0732523 -0.0457781 0.1655639 -0.0745529 -0.0490726 -0.0619053 -0.0773076 -0.0976663 -0.0764956 -0.0150884 -0.1078419 0.1593069 -0.0228464 -0.0387607 -0.0351619 0.0797254 0.2422273 0.0784397 0.0397694 0.0079514 0.3904792 0.0056043 0.0359788 -0.0079415 0.3555854 unknown
polarizability: 160.4564813|6.6486735|102.5138353|-12.9492699|17.2593598|80.8516803 unknown
InChI: InChI=1S/C10H12O2/c1-8(2)7-12-10-6-4-3-5-9(10)11/h3-6,11H,1,7H2,2H3
charge 0 multiplicity 1
24 atoms
O  0.7435 0.281977 -0.056493
O  -0.880393 2.257584 0.716688
C  1.69752 -0.764383 -0.489868
C  -0.632928 -0.041064 -0.075689
C  3.103713 -0.245822 -0.273733
C  -1.461427 1.038984 0.346577
C  -1.20181 -1.270177 -0.462052
C  -2.857394 0.879266 0.390887
C  -2.610396 -1.425152 -0.416159
C  -3.431109 -0.357745 0.009493
C  3.461512 0.15389 1.143438
C  3.980662 -0.196941 -1.310005
H  1.51418 -1.007142 -1.554651
H  1.51735 -1.67217 0.125605
H  -0.573758 -2.100476 -0.798719
H  -3.473178 1.721789 0.719339
H  -3.056988 -2.379077 -0.715261
H  3.338307 -0.699456 1.839118
H  2.788431 0.953381 1.503556
H  4.501947 0.512207 1.213703
H  -4.518579 -0.480684 0.043876
H  3.689151 -0.481048 -2.328094
H  5.016999 0.129399 -1.168105
H  0.103088 2.182861 0.590548
