program: Gaussian 09
title: 000078508
version: EM64L-G09RevD.01
frameworkgroup: C1[X(C6H11NO)]
method: RPBEPBE
basis: SDD
operation: Freq
keyword: #p
keyword: freq=noraman
keyword: PBEPBE/SDD
title: #p freq=noraman PBEPBE/SDD
converged: YES YES NO NO
title: Mulliken charges:
elementType: O N C C C C C C H H H H H H H H H H H
charge: -0.273905 -0.536810 -0.422048 -0.400125 -0.306863 0.361968 -0.387419 -0.526171 0.227083 0.207659 0.217914 0.208810 0.219711 0.200378 0.218313 0.228135 0.220908 0.261277 0.281186
chargesum: 0.00000
title: Mulliken charges with hydrogens summed into heavy atoms:
elementType: O N C C C C C C
charge: -0.273905 0.005653 0.012695 0.026598 0.113225 0.361968 -0.169106 -0.077127
polarizability: 8.63150034e+01 4.29322636e+00 7.60983518e+01 2.12245607e+00 1.40057544e+00 5.61706502e+01
1716.lowfreq: -15.6518 -0.0009 -0.0006 0.0002 5.7002 8.6274 75.4968 113.6259 186.3368
frequency: 75.4739 113.6001 186.3366 232.0016 263.1093 336.7583 354.8883 468.6890 491.2390 567.8966 649.3780 724.6849 760.8623 785.5569 846.8625 859.0425 880.1074 907.9531 965.4284 1037.7754 1069.1811 1075.7158 1082.0289 1141.6379 1155.8685 1179.9549 1222.2615 1255.2213 1285.9454 1329.7871 1332.3284 1337.0733 1343.7212 1372.1786 1440.9965 1454.0157 1462.4355 1472.7573 1647.3160 1674.7255 2958.5022 2974.6956 2997.6738 2999.4584 3016.4562 3062.6550 3066.1744 3087.0362 3140.3838 3436.2678 3561.5889
redmass: 2.7882 3.2206 2.6272 1.5730 1.6203 1.7490 2.2771 3.0924 4.9287 2.6546 1.8864 1.8909 1.6789 2.2908 1.7344 2.0964 1.6831 2.1247 2.3628 3.1139 1.9292 2.5008 1.8391 1.1937 2.1503 1.5439 1.6221 1.1878 1.4789 1.5039 1.2526 1.2756 1.3892 1.3584 1.0810 1.0854 1.0983 1.0918 1.0841 7.2201 1.0646 1.0671 1.0651 1.0616 1.0908 1.1021 1.1020 1.0996 1.0910 1.0449 1.0963
irintensity: 0.9118 1.2926 2.6688 23.3178 15.6433 36.0170 16.2998 11.2660 0.4541 0.7865 129.7647 194.9672 34.3846 7.5015 20.1912 9.7919 13.2273 19.0479 2.9783 90.7322 3.5247 11.5615 3.8669 4.8870 14.7120 1.0383 27.4972 2.4960 31.8657 3.4091 0.8971 2.8542 4.0265 1.2865 11.8273 7.9653 8.5505 6.2073 29.3429 43.9570 48.5847 54.9948 25.4344 31.5306 43.8552 48.5827 22.6839 38.6138 15.8165 2.0516 1.0277
temp: 298.150 k
press: 1.00000 atm
elementType: 8 7 6 6 6 6 6 6 1 1 1 1 1 1 1 1 1 1 1
symmnumber: 1
zpe: 431515.1 jmol-1
zpe.correction: 0.164355 hartree
zpe.thermalcorrener: 0.172614 hartree
zpe.thermalcorrenthalpy: 0.173559 hartree
zpe.thermalcorrgfe: 0.131634 hartree
zpe.sumelectzpe: -364.536401 hartree
zpe.sumelectthermal: -364.528142 hartree
zpe.sumelectthermalent: -364.527198 hartree
zpe.sumelectthermalfe: -364.569122 hartree
dipole: 2.7781 0.0502 1.0922
dipole: 2.9855
quadrupole: -53.8151 -46.4543 -47.7919
quadrupole: -1.2491 -0.9229 -0.9962
quadrupole: -4.4613 2.8995 1.5619 -1.2491 -0.9229 -0.9962
hfenergy: -364.7007564 hartree
pointgroup: C01 [X(C6H11N1O1)]
dipole: -1.0956569 -0.0407866 0.4213505 debye
dipolederiv: -0.7301104 0.3869661 0.0343236 0.1878171 -1.0134724 -0.0111061 0.0622343 0.0223349 -0.3057113 -1.0575259 -0.1151202 -0.0325764 -0.0831518 -0.280225 -0.1068777 -0.0214143 -0.1136338 -0.3243156 -0.0379906 -0.0218555 -0.0337647 -0.07478 -0.0373722 -0.0029451 -0.0303992 -0.0387504 0.0884606 0.0538892 0.0653554 0.008792 -0.0070794 -0.0011351 0.0248959 0.0505211 0.0460396 0.2420924 0.552111 -0.3193927 -0.0558314 -0.0757286 0.3121067 0.0281009 -0.0744599 0.0973964 0.384977 0.2611961 -0.1442052 -0.0783057 -0.1381722 0.9927822 -0.0855044 -0.008397 -0.1372895 -0.0592586 -0.0983047 -0.1574223 -0.0392299 -0.0282019 -0.235587 -0.010441 -0.0579821 0.0429109 -0.3545793 0.4900128 0.1307913 0.0419303 0.0889767 0.2121786 0.1020583 0.0790082 0.0740973 0.3623064 0.0975326 -0.0126324 0.0126656 -0.0153713 0.0334139 0.0026105 -0.0516258 0.018102 -0.1535351 -0.1742589 0.0870945 0.0561354 0.063386 0.0633535 -0.012575 0.0799446 -0.0235847 0.0741377 -0.0451218 -0.1049441 -0.0414617 -0.0838146 -0.0638659 -0.0775826 -0.0903545 -0.1033447 0.0379397 -0.0386165 -0.0364532 0.0621877 0.0417355 0.0780177 0.0202821 0.1162802 0.0762587 -0.1555391 0.0196639 0.0526125 0.0075909 0.0627529 -0.1520862 0.0360632 -0.0074723 0.074178 0.06868 -0.0182336 0.0503607 -0.0239363 -0.0125453 0.0720898 0.031763 0.0335958 -0.0892513 -0.1933821 -0.0044254 0.096661 0.0030713 0.1005586 -0.07675 0.013668 -0.0051768 0.0029457 0.1650887 -0.0025652 -0.041293 0.0174113 -0.0581936 0.0634524 0.1024015 0.0255944 0.0485768 -0.1131447 0.0219712 0.0045089 -0.0145237 0.0479822 -0.1527945 -0.0507475 -0.0231161 0.0097607 0.0888767 0.3447534 -0.0738494 0.1131773 -0.0767307 0.1434798 0.0251669 -0.0019938 0.0377406 -0.012033 0.3660227 0.1528178 -0.0376556 0.0605604 0.0424138 -0.0292309 -0.0747867 -0.044487 0.1589395 unknown
polarizability: 86.231497|4.4637339|76.2511086|-1.8174133|-1.0610914|56.1013999 unknown
InChI: InChI=1S/C6H11NO/c7-5-6-3-1-2-4-8-6/h3H,1-2,4-5,7H2
charge 0 multiplicity 1
19 atoms
O  0.122534 1.080289 -0.234282
N  2.900583 0.307716 0.508697
C  -2.247371 0.297707 -0.20824
C  -1.82479 -1.108167 0.283807
C  -1.238614 1.346143 0.289658
C  0.527746 -0.275613 -0.172218
C  -0.328012 -1.301111 0.102575
C  2.0170 -0.394386 -0.452085
H  -2.267761 0.319744 -1.313776
H  -3.26037 0.55941 0.151155
H  -2.374398 -1.885803 -0.281923
H  -2.111795 -1.244541 1.347623
H  -1.478922 2.363368 -0.059612
H  -1.18903 1.33884 1.398131
H  0.085252 -2.314529 0.153097
H  2.226336 0.018595 -1.457237
H  2.289303 -1.464405 -0.475784
H  2.82271 -0.063275 1.463205
H  2.7461 1.322617 0.500006
