program: Gaussian 09
title: 000078504
version: EM64L-G09RevD.01
frameworkgroup: C1[X(C4H2Cl2N2)]
method: RPBEPBE
basis: SDD
operation: Freq
keyword: #p
keyword: freq=noraman
keyword: PBEPBE/SDD
title: #p freq=noraman PBEPBE/SDD
converged: NO NO NO YES
title: Mulliken charges:
elementType: Cl Cl N N C C C C H H
charge: 0.005991 0.005995 0.196134 0.022578 -0.178996 -0.178997 -0.212125 -0.212125 0.275773 0.275773
chargesum: 0.00000
title: Mulliken charges with hydrogens summed into heavy atoms:
elementType: Cl Cl N N C C C C
charge: 0.005991 0.005995 0.196134 0.022578 -0.178996 -0.178997 0.063648 0.063648
polarizability: 1.18703659e+02 -1.40628661e-04 7.48394681e+01 3.87998341e-03 1.92353608e-04 2.70864522e+01
1716.lowfreq: -0.0038 -0.0019 -0.0009 9.0547 9.9689 16.1304 140.7109 164.9239 187.1348
frequency: 140.6999 164.9215 187.1348 347.0273 356.4416 435.0431 470.0812 558.0298 621.8676 729.3751 776.6265 861.5372 895.3758 936.1776 1090.7824 1147.3857 1163.1304 1250.1379 1363.7394 1366.7032 1472.0770 1498.1965 3178.9068 3183.8863
redmass: 3.6832 13.2193 20.0224 7.6392 19.2114 12.9783 10.4963 6.1842 12.9974 3.3472 9.9750 1.4503 1.4185 6.2608 8.8609 2.1783 2.6704 12.2310 1.6108 2.3930 4.7527 11.5041 1.0920 1.0973
irintensity: 0.0000 0.2569 0.2462 1.3481 5.6261 22.8010 8.9461 0.0000 0.1805 10.7201 137.9944 29.3278 0.0000 30.3345 40.9463 8.3539 195.7029 0.0681 130.5527 8.2381 24.3685 167.9637 3.7045 0.5258
temp: 298.150 k
press: 1.00000 atm
elementType: 17 17 7 7 6 6 6 6 1 1
symmnumber: 1
zpe: 144719.9 jmol-1
zpe.correction: 0.055121 hartree
zpe.thermalcorrener: 0.061846 hartree
zpe.thermalcorrenthalpy: 0.062790 hartree
zpe.thermalcorrgfe: 0.022794 hartree
zpe.sumelectzpe: -1182.651774 hartree
zpe.sumelectthermal: -1182.645049 hartree
zpe.sumelectthermalent: -1182.644105 hartree
zpe.sumelectthermalfe: -1182.684101 hartree
dipole: 0.0000 1.6449 0.0000
dipole: 1.6449
quadrupole: -56.7360 -64.4993 -59.3553
quadrupole: 0.0000 0.0002 0.0000
quadrupole: 3.4608 -4.3024 0.8416 0.0000 0.0002 0.0000
hfenergy: -1182.7068953 hartree
pointgroup: C01 [X(C4H2Cl2N2)]
dipole: -0.0000413 0.6471599 0.0000131 debye
dipolederiv: -0.7996906 0.3309712 -0.0000322 0.4444616 -0.2907243 0.0000188 -0.0000447 0.0000206 -0.0562174 -0.79962 -0.3310146 -0.00002 -0.4445053 -0.2907883 -0.0000135 0.0000034 0.0000032 -0.0562142 -1.1450101 -0.0000388 -0.000029 -0.0000454 -0.2656536 -0.000012 -0.0000334 0.0000114 -0.1091789 0.1525678 0.0000225 0.000019 0.0000287 -0.3237581 0.000008 0.0000158 -0.0000083 -0.2260287 1.5046502 -0.4751603 0.0000606 -0.7649146 0.4938852 -0.0000323 0.0000608 -0.000031 0.058378 1.504539 0.4752455 0.0000198 0.7650126 0.4939971 0.0000285 0.0000163 -0.0000093 0.0583756 -0.20682 0.1263602 0.0000043 0.5278067 0.002125 0.0000311 0.0000062 0.0000087 0.0133985 -0.2067619 -0.1263768 -0.0000028 -0.5278372 0.0020577 -0.0000254 -0.0000114 0.0000108 0.0133973 -0.0019245 -0.0267804 -0.0000121 -0.0537884 0.089426 -0.0000045 -0.0000104 -0.0000024 0.1520445 -0.00193 0.0267714 -0.0000075 0.0537814 0.0894333 0.0000013 -0.0000026 -0.0000036 0.1520453 unknown
polarizability: 118.7036586|0.0016909|74.8394681|0.00388|0.0001925|27.0864522 unknown
InChI: InChI=1S/C4H2Cl2N2/c5-3-1-7-2-4(6)8-3/h1-2H
charge 0 multiplicity 1
10 atoms
Cl 2.70816 -1.223667 0.000117
Cl -2.708019 -1.223897 -0.000078
N  0.000057 -1.005787 -0.000025
N  -0.000064 1.814085 0.000021
C  1.146304 -0.303304 0.000035
C  -1.146251 -0.303404 -0.000078
C  1.170852 1.115099 0.000081
C  -1.170923 1.114994 -0.000062
H  2.106001 1.67958 0.000172
H  -2.106118 1.6794 -0.000084
