program: Gaussian 09
title: 000078506
version: EM64L-G09RevD.01
frameworkgroup: C1[X(C2H6N6Si)]
method: RPBEPBE
basis: SDD
operation: Freq
keyword: #p
keyword: freq=noraman
keyword: PBEPBE/SDD
title: #p freq=noraman PBEPBE/SDD
converged: NO YES NO NO
title: Mulliken charges:
elementType: Si N N N N N N C C H H H H H H
charge: 1.351920 -0.403013 -0.402462 0.009721 0.008692 -0.051854 -0.051767 -1.012722 -1.013081 0.270796 0.263227 0.248160 0.248143 0.270825 0.263415
chargesum: 0.00000
title: Mulliken charges with hydrogens summed into heavy atoms:
elementType: Si N N N N N N C C
charge: 1.351920 -0.403013 -0.402462 0.009721 0.008692 -0.051854 -0.051767 -0.230539 -0.230698
polarizability: 1.10645371e+02 -2.23218635e-02 9.86069471e+01 -1.12725241e+01 -5.93844522e-03 6.53377214e+01
1716.lowfreq: -10.9725 -5.8492 -0.0007 0.0017 0.0018 4.2094 34.9876 60.4695 89.6755
frequency: 34.9865 60.4185 89.6678 98.7818 121.4571 134.7659 180.1891 196.9626 214.1709 281.7197 290.7535 472.3230 508.3602 520.9617 522.0868 554.3136 585.1875 680.6771 738.9341 826.3296 850.8564 900.3061 920.5779 1316.4044 1323.8048 1324.1821 1325.9818 1436.9667 1439.2325 1446.1047 1450.6975 2088.1174 2105.4392 2997.7346 2998.5347 3102.9129 3103.9322 3108.8173 3109.5421
redmass: 11.7086 6.4310 4.5665 6.9172 1.0261 1.0364 2.7958 4.8787 3.0738 8.2617 5.3306 8.2858 11.2295 13.6715 13.8666 11.5921 9.9280 4.6272 2.3182 1.2423 1.8868 1.4584 1.4436 1.2019 10.2346 1.2944 8.8688 1.0497 1.0518 1.0468 1.0460 13.9761 13.9803 1.0347 1.0347 1.0985 1.0981 1.0992 1.0990
irintensity: 0.2462 1.2432 0.3380 0.9729 0.0250 0.0729 0.3354 0.2230 3.1523 27.9220 32.0258 29.2544 63.8761 0.2885 8.2518 0.0169 74.7427 54.8643 8.3807 2.4154 102.2044 192.5552 141.6538 60.2791 166.9214 54.6161 81.0508 3.6525 0.0545 9.1737 15.1132 691.9298 432.4308 2.2460 2.7868 1.8442 8.6147 6.8222 8.4699
temp: 298.150 k
press: 1.00000 atm
elementType: 14 7 7 7 7 7 7 6 6 1 1 1 1 1 1
symmnumber: 1
zpe: 259967.6 jmol-1
zpe.correction: 0.099016 hartree
zpe.thermalcorrener: 0.110718 hartree
zpe.thermalcorrenthalpy: 0.111662 hartree
zpe.thermalcorrgfe: 0.060180 hartree
zpe.sumelectzpe: -696.977086 hartree
zpe.sumelectthermal: -696.965384 hartree
zpe.sumelectthermalent: -696.964440 hartree
zpe.sumelectthermalfe: -697.015923 hartree
dipole: -0.0151 4.3520 0.0064
dipole: 4.3521
quadrupole: -71.4026 -61.7741 -59.5735
quadrupole: -0.0145 -1.6649 -0.0132
quadrupole: -7.1525 2.4760 4.6766 -0.0145 -1.6649 -0.0132
hfenergy: -697.0761025 hartree
pointgroup: C01 [X(C2H6N6Si1)]
dipole: 0.0128864 1.7121747 -0.0049883 debye
dipolederiv: 2.4984363 0.0018231 0.0359475 -0.0034805 2.2098218 -0.0005994 0.6188296 -0.0029509 1.4947237 -1.4842695 -0.7075124 -0.0150217 -0.9059533 -1.2116166 -0.0544431 0.001607 0.0949167 -0.4145403 -1.4750274 0.7097094 -0.018015 0.9080658 -1.2196156 0.0567446 -0.0057936 -0.0916559 -0.4148557 1.1771921 0.8613803 -0.0457643 1.0549638 0.8983201 -0.0384806 -0.406919 -0.2735907 -0.0308519 1.1722627 -0.8652171 -0.040696 -1.0553018 0.9041721 0.0347273 -0.4023507 0.2732413 -0.0324357 -0.6590903 -0.4231338 -0.0038811 -0.5367954 -0.4909928 -0.0039053 0.1383202 0.0755301 -0.0635777 -0.6554828 0.423446 -0.0067116 0.5382953 -0.4946529 0.0065054 0.1380478 -0.0759916 -0.0629743 -0.4267301 -0.025188 0.0774958 -0.0297442 -0.4230207 -0.0271195 0.0317017 -0.1052763 -0.3888026 -0.4252517 0.0250018 0.077359 0.0307813 -0.4236901 0.0262116 0.033086 0.1047855 -0.3900611 0.0668341 -0.072727 0.0800171 -0.0411971 0.0748135 0.0516359 0.0705755 0.0900905 0.0134708 0.0745158 -0.0427031 -0.0539223 -0.1052542 0.0249385 -0.0708728 -0.1077027 -0.1015964 0.0547058 -0.0028896 0.098222 -0.056284 0.103462 0.0264213 0.0489228 -0.0356334 0.0423507 0.083161 -0.0063591 -0.098163 -0.0564654 -0.1029726 0.0291023 -0.047629 -0.0356829 -0.0412277 0.0838333 0.0687227 0.0732861 0.0788021 0.0414057 0.0721948 -0.0534035 0.0684809 -0.0918047 0.0141233 0.0771368 0.0417756 -0.05286 0.1037251 0.0238045 0.0717056 -0.1065665 0.1031794 0.0540812 unknown
polarizability: 113.2114353|-0.0396682|98.606918|-2.0541245|-0.0579915|62.7716865 unknown
InChI: InChI=1S/C2H6N6Si/c1-9(2,7-5-3)8-6-4/h1-2H3
charge 0 multiplicity 1
15 atoms
Si 0.006504 1.00911 -0.000302
N  -1.120092 -0.03257 -0.959725
N  1.11458 -0.046357 0.96583
N  -2.00067 -0.86771 -0.659084
N  1.995117 -0.883229 0.669449
N  -2.856407 -1.676711 -0.503869
N  2.846509 -1.69682 0.514303
C  -0.925322 1.998278 1.308049
C  0.954009 1.974999 -1.314919
H  -1.428771 1.322569 2.021047
H  -0.225613 2.632407 1.880535
H  -1.686649 2.648524 0.843435
H  1.727038 2.614612 -0.854888
H  1.444515 1.286988 -2.025147
H  0.264453 2.618109 -1.889715
