program: Gaussian 09
title: 000078527
version: EM64L-G09RevD.01
frameworkgroup: C1[X(C11H11IN)]
method: RPBEPBE
basis: SDD
operation: Freq
keyword: #p
keyword: freq=noraman
keyword: PBEPBE/SDD
title: #p freq=noraman PBEPBE/SDD
converged: YES YES NO NO
title: Mulliken charges:
elementType: I N C C C C C C C C C C C H H H H H H H H H H H
charge: 0.357664 -0.124719 0.234355 0.386407 -0.395934 -0.376095 -0.294909 -0.241401 -0.037841 -0.353328 -0.628679 -0.220041 -0.224177 0.261405 0.256198 0.270229 0.286505 0.280213 0.268111 0.247028 0.262422 0.244852 0.268591 0.273144
chargesum: 1.00000
title: Mulliken charges with hydrogens summed into heavy atoms:
elementType: I N C C C C C C C C C C C
charge: 0.357664 -0.124719 0.234355 0.386407 0.121669 -0.376095 -0.024680 0.045104 0.242371 -0.085217 0.125622 0.048551 0.048968
polarizability: 2.48299438e+02 1.54635660e+00 1.44250619e+02 -1.13714460e+00 -8.00570267e+00 6.10713940e+01
1716.lowfreq: -12.3527 -8.4612 0.0004 0.0004 0.0005 6.7129 52.7069 83.3382 104.5546
frequency: 52.6618 83.3253 104.5393 167.5098 186.2743 196.1765 216.0720 240.9351 331.3398 375.0653 418.7609 468.9314 495.5782 507.7340 534.6205 561.7263 575.8052 654.2833 687.7618 760.3575 773.7638 779.0464 823.3342 833.1605 842.9243 884.4650 955.7247 971.8583 996.5416 1014.7764 1029.2700 1041.7440 1085.3120 1087.6568 1150.0656 1160.2478 1177.2152 1196.8103 1226.5772 1257.5178 1288.2847 1304.0270 1341.3048 1373.5031 1400.2504 1418.8177 1425.1471 1445.3662 1466.3628 1481.0943 1505.8578 1513.6325 1563.0693 1581.7983 1618.8403 3004.2699 3060.4083 3098.7041 3106.3840 3122.3492 3154.4587 3162.1516 3163.9120 3184.6015 3199.8239 3206.4925
redmass: 4.5198 3.5622 3.4729 4.6001 4.0371 1.0676 9.0707 4.3983 3.5417 3.1284 3.3299 3.3406 4.0303 3.6682 4.3085 5.0903 4.9170 4.6924 4.8109 1.5830 2.0156 1.4839 3.4399 3.8284 1.2928 1.5181 2.5783 1.3441 1.3985 1.3774 4.0073 2.4266 2.0312 2.1970 2.1707 1.6082 1.5363 1.2049 1.6504 1.6863 1.6182 1.6644 1.3823 2.8204 1.2063 6.9166 1.9772 2.1637 1.0426 1.0511 1.7468 1.5674 6.0169 6.5051 6.2266 1.0364 1.0621 1.1013 1.0989 1.1040 1.0898 1.0928 1.0915 1.0977 1.0959 1.0965
irintensity: 0.5677 0.1173 0.3725 0.5960 2.5099 0.2778 4.3036 0.4425 6.1285 2.2513 6.7163 5.1787 4.4324 0.2574 1.9915 3.7274 0.8870 3.9988 4.4509 25.0440 34.3923 6.0925 16.6748 1.9278 46.0555 17.1729 6.0569 0.6335 2.1650 0.0813 25.7200 7.1451 15.6527 30.8160 15.4210 36.8038 18.6482 0.2668 0.8364 22.5231 5.3817 15.6202 6.3903 6.5353 17.7949 29.8937 15.2673 10.2631 18.7794 2.0196 96.0090 49.7393 75.8024 69.5073 29.3757 4.8205 8.2893 4.2961 11.2781 5.4773 0.1967 0.4887 0.9117 2.2644 0.9993 2.6026
temp: 298.150 k
press: 1.00000 atm
elementType: 53 7 6 6 6 6 6 6 6 6 6 6 6 1 1 1 1 1 1 1 1 1 1 1
symmnumber: 1
zpe: 503020.0 jmol-1
zpe.correction: 0.191590 hartree
zpe.thermalcorrener: 0.203054 hartree
zpe.thermalcorrenthalpy: 0.203998 hartree
zpe.thermalcorrgfe: 0.152617 hartree
zpe.sumelectzpe: -490.874819 hartree
zpe.sumelectthermal: -490.863355 hartree
zpe.sumelectthermalent: -490.862411 hartree
zpe.sumelectthermalfe: -490.913792 hartree
dipole: 4.9692 0.4255 -0.0410
dipole: 4.9876
quadrupole: -44.4843 -62.9313 -91.2377
quadrupole: -1.9611 -0.0891 -3.0592
quadrupole: 21.7335 3.2864 -25.0199 -1.9611 -0.0891 -3.0592
hfenergy: -491.0664096 hartree
pointgroup: C01 [X(C11H11I1N1)]
dipole: 1.9179637 -0.4129242 -0.0376865 debye
dipolederiv: -0.3958993 0.0369331 0.0248982 -0.0710172 0.1771096 0.0060705 0.0275306 0.0029453 0.195332 -0.5147801 0.1240804 0.0025256 -0.0581308 -0.5437981 0.0010966 0.0077326 0.0243328 -0.0807375 0.1842659 0.0253883 0.0013247 -0.4881734 0.1059603 0.0116419 0.0375449 0.0095488 0.0801905 -0.0812516 -0.0662992 0.0159186 0.5855956 -0.325615 0.0184621 -0.0580613 0.0457044 0.0583114 0.1308947 0.1869047 0.0025982 0.1078991 0.4442404 0.0266815 -0.0133744 -0.0683243 0.1779822 1.4228554 -0.2068052 -0.0552553 0.5334182 0.3592975 -0.0574647 -0.0942551 -0.0433196 -0.1036196 -0.3093372 0.0625955 0.0007108 0.0967036 0.0404243 -0.0026271 0.0142016 -0.0187325 -0.136101 0.7238868 0.0898754 -0.0351545 -0.3569043 0.2577496 -0.0235556 0.0145964 -0.0336504 -0.0197755 -0.9693747 -0.2347676 0.0573208 -0.462865 -0.0857857 0.012192 0.0895301 0.0171354 -0.0715118 0.1119096 0.0069871 -0.0117969 0.1232256 0.13254 -0.0329334 -0.0237839 -0.0287084 -0.1096292 0.0475916 -0.0368677 -0.0031676 -0.0453522 -0.0518786 -0.016374 0.0045237 0.0435027 -0.0259099 -0.0044037 -0.0219637 -0.0034655 -0.1516883 0.2379356 -0.029174 0.0066901 -0.0293093 -0.0783679 0.2111648 0.0475042 -0.0197556 0.2029497 -0.2194673 0.0056796 -0.0355875 0.009828 -0.0947086 0.0280739 0.0519661 -0.1297271 -0.0027119 0.0221826 0.0150859 -0.067598 0.0027878 0.0301299 0.0158128 -0.029804 0.0822691 0.0222995 0.055301 -0.0855004 0.0221504 -0.0420282 0.0714292 0.081569 -0.0727092 0.0158564 -0.048229 0.0093973 0.009502 0.0125119 0.0151813 0.1549115 0.0594142 -0.0604577 0.0106477 -0.0091868 0.056631 0.0120498 0.0045397 0.0146268 0.1478253 0.0631992 0.0441606 -0.0020007 0.0158389 0.0929751 0.0081059 -0.0044537 0.0062266 0.17042 0.0891942 0.002533 0.002755 -0.054891 -0.0059688 0.0206614 0.0082302 0.0194059 0.1572611 0.0301081 0.0517513 -0.0734339 0.0939574 0.0477085 0.066964 -0.0303591 0.0256722 0.0262323 0.0858857 -0.0704851 0.0161171 -0.0762791 -0.0474632 0.0282219 0.016313 0.0159709 0.0795194 -0.0606731 0.0329201 0.0925975 0.0004231 0.1139559 -0.0121185 0.0494162 -0.0058196 0.0471248 0.0667943 0.049704 -0.0014194 0.0475905 0.0203207 0.0112434 0.0002453 0.0111264 0.1571948 -0.0169006 -0.0131443 0.0096367 -0.0044721 0.1062471 0.0060894 0.0117161 0.0058971 0.1664965 unknown
polarizability: 246.1570154|-14.6279857|146.6967638|-4.3337233|-5.2284551|60.7676719 unknown
InChI: InChI=1S/C11H11IN/c1-2-13-10-6-4-3-5-9(10)7-8-11(13)12/h3-8H,2H2,1H3
charge 1 multiplicity 1
24 atoms
I  -3.890084 0.704762 0.165433
N  -0.992779 -0.360026 0.221319
C  0.424104 -0.282072 0.120644
C  1.042451 1.012527 -0.060649
C  -1.620927 -1.716751 0.437378
C  -1.764959 0.769862 0.096911
C  1.248315 -1.442513 0.192051
C  0.211881 2.167415 -0.161027
C  -1.175133 2.046853 -0.092923
C  2.468052 1.10809 -0.141898
C  -1.846349 -2.472617 -0.884419
C  2.641013 -1.31158 0.105915
C  3.260782 -0.036435 -0.05623
H  -0.972351 -2.273774 1.129985
H  -2.575966 -1.556667 0.960563
H  0.82638 -2.442228 0.301489
H  0.667335 3.153382 -0.299137
H  -1.824146 2.919182 -0.180236
H  2.922456 2.095551 -0.273814
H  -2.539408 -1.927573 -1.547337
H  -2.298003 -3.454489 -0.660673
H  -0.905133 -2.646855 -1.432435
H  3.262965 -2.210434 0.161522
H  4.350205 0.035493 -0.116733
