program: Gaussian 09
title: 000000107
version: EM64L-G09RevD.01
frameworkgroup: C1[X(C9H10O2)]
method: RPBEPBE
basis: SDD
operation: Freq
keyword: #pfreq=noraman
keyword: PBEPBE/SDD
title: #p freq=noraman PBEPBE/SDD
converged: NO NO NO NO
title: Mulliken charges:
elementType: O O C C C C C C C C C H H H H H H H H H H
charge: -0.413960 -0.233585 -0.558279 0.492539 -0.485123 -0.406421 -0.407612 -0.225829 -0.225422 0.188873 -0.241666 0.230750 0.232166 0.266315 0.265968 0.232873 0.233126 0.225071 0.225029 0.228492 0.376695
chargesum: 0.00000
title: Mulliken charges with hydrogens summed into heavy atoms:
elementType: O O C C C C C C C C C
charge: -0.037265 -0.233585 -0.095363 0.492539 0.047160 -0.173548 -0.174486 -0.000758 -0.000392 0.188873 -0.013174
polarizability: 1.32430414e+02 -3.65740768e-01 9.24486583e+01 -1.16018121e+01 -4.89387156e-01 6.77827896e+01
1716.lowfreq: -11.1557 -4.7283 -0.0008 -0.0008 -0.0007 12.5643 20.4873 32.0694 74.7568
frequency: 17.3455 31.2484 74.7499 75.9035 184.7674 252.1331 327.5828 402.3387 411.1710 504.8471 517.7109 537.5114 606.2362 617.4373 641.2715 706.4963 759.5938 780.3264 800.0712 854.2160 877.0219 925.2676 975.8935 990.0318 994.9136 996.9959 1021.4562 1027.9924 1080.6211 1086.2194 1152.8419 1172.4742 1187.4788 1219.4187 1240.9214 1270.5138 1304.7608 1327.8688 1368.7161 1382.9901 1439.2946 1441.0694 1476.2211 1484.2213 1593.5695 1616.0270 1661.8025 2999.3815 3012.2579 3044.5745 3074.8745 3113.5259 3113.9683 3131.6050 3143.5338 3162.5760 3510.1485
redmass: 7.6879 3.5584 4.4022 2.4358 6.9531 4.9925 2.3529 2.8227 4.5984 1.7739 3.3843 4.8380 4.7991 6.3499 1.3178 1.7704 1.8647 1.3708 4.8433 1.2471 2.8571 1.6140 1.3882 6.2776 1.3154 1.8554 3.4076 2.3125 2.4608 1.5665 1.1810 1.0517 1.1164 2.4396 1.4369 1.1772 1.7571 1.2498 1.8043 7.8137 1.0837 2.1729 1.1250 2.2378 6.0477 6.2045 8.1539 1.0613 1.0600 1.0988 1.1030 1.0883 1.0864 1.0904 1.0957 1.1014 1.0639
irintensity: 0.7976 0.0002 0.5216 0.5249 3.8226 0.3541 0.0006 0.0063 9.5235 27.3188 49.6273 12.4247 7.7249 0.2204 131.0395 52.7781 40.7385 7.7582 5.6905 0.0794 1.2451 1.7357 0.0127 0.9783 0.1258 4.0797 122.8973 80.5066 102.5864 6.6009 2.7737 0.1491 0.1963 0.2911 1.4499 0.1275 53.4197 0.2101 44.9671 0.1063 28.3481 7.3892 18.6584 16.1119 1.3214 9.4438 223.0538 5.6691 20.6910 0.1779 17.4955 6.2793 12.5600 8.7144 44.0767 22.5171 18.3656
temp: 298.150 k
press: 1.00000 atm
elementType: 8 8 6 6 6 6 6 6 6 6 6 1 1 1 1 1 1 1 1 1 1
symmnumber: 1
zpe: 440979.5 jmol-1
zpe.correction: 0.167960 hartree
zpe.thermalcorrener: 0.178253 hartree
zpe.thermalcorrenthalpy: 0.179197 hartree
zpe.thermalcorrgfe: 0.129308 hartree
zpe.sumelectzpe: -498.608756 hartree
zpe.sumelectthermal: -498.598463 hartree
zpe.sumelectthermalent: -498.597519 hartree
zpe.sumelectthermalfe: -498.647408 hartree
dipole: 0.4992 -0.0837 -1.4045
dipole: 1.4929
quadrupole: -58.2419 -58.6494 -72.4324
quadrupole: 0.2926 3.6343 -0.6519
quadrupole: 4.8660 4.4585 -9.3245 0.2926 3.6343 -0.6519
hfenergy: -498.7767158 hartree
pointgroup: C01 [X(C9H10O2)]
dipole: -0.1971092 0.0333016 -0.5523038 debye
dipolederiv: -0.8061782 -0.036431 0.5437676 -0.0367495 -0.4268193 0.0304291 0.5382026 0.0308512 -0.8853982 -0.7534393 0.0152571 -0.2473402 -0.0027695 -0.3063572 0.0407949 0.0252343 0.0397638 -0.9392189 -0.0029441 -0.0005295 -0.0050995 -0.002267 0.1375072 0.0028446 0.0839695 0.0019845 0.1027125 0.3639781 -0.0010703 0.0632004 -0.0020076 -0.0355149 0.0008837 0.0717327 0.000902 -0.0574561 -0.3753867 0.0013057 -0.072748 0.0085102 0.1381824 0.0096181 -0.3155627 0.009219 -0.0534166 -0.1631675 0.051944 0.0332677 0.1012471 0.0505915 0.0382399 0.0250999 0.0244183 -0.1501751 -0.1623776 -0.054906 0.02942 -0.1028924 0.0536504 -0.0234565 0.0177431 -0.0099367 -0.1537063 -0.0017748 -0.0577255 0.0401537 -0.0799766 0.0969335 -0.0083663 0.0415979 -0.0054649 -0.1316347 -0.0028283 0.0544238 0.044192 0.0764886 0.0951672 0.0247143 0.04716 0.0221685 -0.1292923 1.4642178 0.0132553 -0.1314885 0.0232394 0.1985025 -0.0848861 -0.2252506 -0.0838624 1.499987 0.0449345 -0.0026307 0.0793763 -0.0022938 -0.0952711 0.0022862 0.0665344 0.0021252 -0.1518773 0.0391175 -0.0113888 -0.0208349 -0.0477638 -0.0461147 -0.1078712 -0.0118839 -0.0673585 0.0074204 0.0414464 0.0133402 -0.0205509 0.0482752 -0.0574018 0.1010931 -0.0081969 0.0615255 0.0218305 0.0819123 -0.0252638 -0.0080134 -0.0107155 0.0027824 -0.1000782 0.0169878 -0.0658394 0.0323915 0.0814892 0.0264012 -0.0052882 0.011909 -0.010951 0.0966879 0.0193182 0.0629001 0.0453811 0.0395517 -0.1034425 -0.0452843 -0.0915583 -0.05507 -0.0311313 -0.0455019 -0.0390629 0.1270323 0.039235 0.1063893 -0.0379022 0.0946503 -0.058253 0.0175013 -0.0389486 0.0255957 0.1312938 0.0279581 0.0888929 -0.0306258 0.1039676 -0.0786207 0.0175318 -0.03651 0.015657 0.1471795 0.0285595 -0.0861924 -0.0368673 -0.1006932 -0.0757922 -0.0336905 -0.0438907 -0.0319641 0.1435613 -0.1156778 0.0024964 -0.0806094 0.0025955 0.0864563 -0.0020812 -0.0842183 -0.0020621 0.1392682 0.1313745 0.0058745 -0.090725 0.0088042 0.3863925 0.0089364 -0.1436169 0.0084402 0.2541177 unknown
polarizability: 132.4577674|-0.2890644|92.4455534|11.5278982|0.5540086|67.7585416 unknown
InChI: InChI=1S/C9H10O2/c10-9(11)7-6-8-4-2-1-3-5-8/h1-5,10H,6-7H2
charge 0 multiplicity 1
21 atoms
O  3.88607 0.087686 -1.248956
O  3.592645 -0.063421 1.048572
C  0.701258 -0.024323 0.798632
C  -0.768655 -0.013509 0.40419
C  1.616295 0.028566 -0.449182
C  -1.466883 1.210595 0.239228
C  -1.462436 -1.225323 0.152166
C  -2.819275 1.225879 -0.169665
C  -2.814808 -1.215955 -0.257066
C  3.090819 0.01105 -0.095497
C  -3.498207 0.011171 -0.421496
H  0.937264 0.837256 1.449239
H  0.944165 -0.932272 1.379748
H  1.412837 -0.824345 -1.124888
H  1.414777 0.935147 -1.051211
H  -0.948982 2.15705 0.441382
H  -0.94143 -2.182082 0.286322
H  -3.343453 2.181277 -0.286647
H  -3.335557 -2.162382 -0.442447
H  -4.547885 0.020408 -0.735809
H  4.84684 0.071228 -0.986416
