program: Gaussian 09
title: 000078502
version: EM64L-G09RevD.01
frameworkgroup: C1[X(C8H6N2O2)]
method: RPBEPBE
basis: SDD
operation: Freq
keyword: #pfreq=noraman
keyword: PBEPBE/SDD
title: #p freq=noraman PBEPBE/SDD
converged: YES YES NO YES
title: Mulliken charges:
elementType: O O N N C C C C C C C C H H H H H H
charge: -0.217891 -0.226044 -0.412291 0.019496 0.284284 0.291219 -0.488042 -0.371527 -0.375998 0.419145 -0.388211 -0.206943 0.289624 0.250919 0.321305 0.265987 0.282455 0.262514
chargesum: 0.00000
title: Mulliken charges with hydrogens summed into heavy atoms:
elementType: O O N N C C C C C C C C
charge: -0.217891 -0.226044 -0.090986 0.019496 0.284284 0.291219 -0.198418 -0.120608 -0.110011 0.419145 -0.105756 0.055571
polarizability: 1.91504863e+02 -4.87828017e+00 1.15343777e+02 4.38880873e-03 -6.64703600e-03 4.12654330e+01
1716.lowfreq: -6.3136 -0.0007 -0.0005 0.0005 3.6070 10.0489 65.0277 108.4955 196.3741
frequency: 65.0107 108.4948 196.3741 238.8755 291.4986 342.6342 385.1417 421.6597 522.1490 549.0510 569.8269 570.1920 604.2497 658.6730 699.9462 742.9369 753.4367 777.1091 787.3459 842.8738 877.3978 888.6373 911.8782 920.5429 980.7527 1057.3982 1066.3677 1108.7268 1129.4676 1202.4020 1217.7781 1237.2990 1277.0792 1328.8031 1359.6240 1381.7284 1424.4858 1477.6241 1482.3653 1503.7855 1586.8070 1631.3898 3153.1952 3174.3772 3189.0754 3218.3959 3242.6329 3609.0999
redmass: 10.4771 6.1125 7.6834 4.0049 5.7113 10.1838 5.3530 2.8881 6.2663 1.3988 4.8640 6.5584 2.2384 7.9483 6.0354 1.8522 8.6056 1.8258 5.3120 1.5089 1.3952 4.3845 1.4862 4.6805 1.3246 1.8217 1.7024 1.5835 1.3240 3.2626 3.1009 1.5534 3.0118 1.7258 9.9392 4.2281 3.0629 5.7849 3.1534 5.2381 7.0281 7.3204 1.0904 1.0929 1.0950 1.0914 1.1067 1.0814
irintensity: 0.1083 0.4653 1.6166 10.1214 4.1891 0.0910 3.2848 10.3617 3.2519 80.2934 3.4037 2.2011 21.3460 7.7680 24.3871 32.3856 13.6688 28.8436 0.8395 53.3503 5.6737 10.3709 41.1530 2.5523 0.5156 39.5381 2.9049 38.1515 29.1624 239.7520 173.6173 51.4541 53.1973 6.7718 131.5515 43.0281 30.6707 41.1756 14.8293 7.6643 4.1326 32.6902 7.2229 1.9891 3.2953 0.6204 1.8818 75.9017
temp: 298.150 k
press: 1.00000 atm
elementType: 8 8 7 7 6 6 6 6 6 6 6 6 1 1 1 1 1 1
symmnumber: 1
zpe: 339539.6 jmol-1
zpe.correction: 0.129324 hartree
zpe.thermalcorrener: 0.138213 hartree
zpe.thermalcorrenthalpy: 0.139157 hartree
zpe.thermalcorrgfe: 0.094792 hartree
zpe.sumelectzpe: -567.494097 hartree
zpe.sumelectthermal: -567.485208 hartree
zpe.sumelectthermalent: -567.484264 hartree
zpe.sumelectthermalfe: -567.528629 hartree
dipole: 7.2290 -0.9268 0.0011
dipole: 7.2881
quadrupole: -75.6467 -58.1027 -71.7419
quadrupole: -7.4957 -0.0025 -0.0032
quadrupole: -7.1496 10.3944 -3.2448 -7.4957 -0.0025 -0.0032
hfenergy: -567.623421 hartree
pointgroup: C01 [X(C8H6N2O2)]
dipole: 2.8415792 0.3837683 -0.0004374 debye
dipolederiv: -0.9626169 -0.2008649 -0.0000495 -0.3213318 -0.5908561 -0.0001289 0.0002789 0.0001364 -0.2373954 -0.7256246 0.1764896 0.0000158 0.4519554 -0.7658929 0.0000885 0.0002127 -0.0002235 -0.2452456 -0.1465206 0.1803363 -0.0000304 -0.2127573 -0.6096336 0.0000263 0.0000466 0.000004 -0.2791685 2.2126187 -0.0631643 -0.0000603 -0.2827184 1.1009578 0.0000813 -0.0003047 0.0000672 0.186997 -0.2045004 0.2743535 -0.000007 0.6405343 0.1383019 0.0000061 -0.0000995 0.0000242 0.0326307 0.654078 0.1702996 -0.0000289 -0.2007954 -0.1282445 0.0000178 0.0000321 0.0000178 0.0321725 0.51084 -0.1271027 -0.0000005 0.2109405 -0.0912612 -0.0000215 -0.0000929 0.0000197 -0.1276985 -0.238412 -0.0956072 0.0000268 -0.0875279 0.1580783 -0.0000482 -0.0000224 -0.0000563 -0.1475789 -0.4439806 -0.2264521 0.0000437 -0.3317476 -0.1539904 -0.000008 0.0000375 -0.0000133 -0.2658696 -1.0930833 0.0852198 0.000073 0.0718898 0.0892866 -0.0000535 -0.0000018 -0.0000112 0.0361251 0.1313358 0.0684222 -0.0000017 -0.2652473 -0.0574871 0.0000044 -0.0000719 -0.0000059 -0.1450104 -0.149286 -0.285591 0.0000476 0.2304103 0.5194502 -0.0000936 -0.0000212 -0.0000825 -0.1313825 0.1137215 0.0224692 -0.0000061 0.0013862 0.035574 0.0000274 -0.0000074 0.0000048 0.189448 0.06018 0.0570959 -0.0000049 0.0395389 -0.0656625 0.0000339 0.0000283 0.0000389 0.1583234 0.1733883 0.0399635 -0.0000122 0.0570612 0.234401 0.0000157 -0.0000068 0.0000268 0.3516836 0.027665 0.0472289 -0.000009 0.0830814 0.0293462 0.0000247 -0.0000102 0.0000235 0.2024032 0.0738439 -0.0767327 0.0000026 -0.0219541 0.0767212 0.0000133 0.0000096 0.0000141 0.1778695 0.0063535 -0.0463638 0.0000009 -0.0627181 0.0809111 0.0000142 -0.000007 0.0000152 0.2116966 unknown
polarizability: 191.4357682|5.3902856|115.4128719|-0.004344|-0.0066764|41.265433 unknown
InChI: InChI=1S/C8H6N2O2/c11-10(12)7-2-1-6-3-4-9-8(6)5-7/h1-5,9H
charge 0 multiplicity 1
18 atoms
O  -3.51697 -0.707728 0.000248
O  -3.004546 1.515526 0.000301
N  2.203583 1.436598 -0.000196
N  -2.664248 0.26521 -0.000212
C  1.055991 0.634274 -0.000151
C  1.498049 -0.742332 0.000071
C  -0.300815 0.997104 -0.000233
C  0.521355 -1.777282 0.000197
C  2.940298 -0.723475 0.000096
C  -1.226772 -0.067045 -0.00011
C  -0.83896 -1.43984 0.000105
C  3.336021 0.616437 -0.000071
H  -0.659654 2.029818 -0.000367
H  0.826819 -2.828385 0.00036
H  2.210211 2.454503 -0.000342
H  3.607246 -1.583092 0.000221
H  -1.62143 -2.202287 0.000177
H  4.337121 1.043897 -0.000094
