program: Gaussian 09
title: 000078495
version: EM64L-G09RevD.01
frameworkgroup: C1[X(C3H8S3)]
method: RPBEPBE
basis: SDD
operation: Freq
keyword: #p
keyword: freq=noraman
keyword: PBEPBE/SDD
title: #p freq=noraman PBEPBE/SDD
converged: YES YES NO NO
title: Mulliken charges:
elementType: S S S C C C H H H H H H H H
charge: 0.011232 0.008975 -0.028911 -0.373196 -0.652363 -0.668575 0.299936 0.279926 0.255543 0.267737 0.294360 0.104760 0.091474 0.109101
chargesum: 0.00000
title: Mulliken charges with hydrogens summed into heavy atoms:
elementType: S S S C C C
charge: 0.115992 0.100449 0.080190 -0.073260 -0.116894 -0.106478
polarizability: 9.04311747e+01 -3.86541213e-01 8.17386447e+01 4.58991775e+00 -2.94558723e+00 6.46167458e+01
1716.lowfreq: -8.6674 -0.0032 0.0011 0.0020 8.8644 16.9881 83.5251 88.5396 112.8263
frequency: 83.4416 88.5274 112.7759 142.5378 204.2823 210.6586 282.6429 308.4205 349.1198 490.4715 556.2744 652.3985 702.6116 770.6740 817.7608 838.1064 930.9802 958.5157 1014.8316 1082.8281 1150.1243 1216.6585 1219.2387 1269.4088 1298.1598 1319.4830 1425.3850 1448.2414 2411.8041 2418.6779 2424.9451 3015.5104 3020.4508 3031.7692 3094.9985 3106.7662
redmass: 3.3710 4.7352 1.1748 7.7647 1.1940 4.6996 1.4911 1.5867 2.5602 5.2759 4.7305 3.8054 2.1152 1.5156 1.1352 1.3471 1.4046 1.6924 2.3251 1.7421 1.2417 1.2257 1.1714 1.2301 1.2073 1.3273 1.0809 1.0881 1.0381 1.0378 1.0379 1.0589 1.0656 1.0768 1.1064 1.1048
irintensity: 1.3334 3.8804 81.0603 0.7968 24.8881 0.7033 1.1879 3.7037 4.7525 4.1962 6.6922 8.4331 3.7067 2.5700 8.2220 10.3652 1.8251 10.0381 19.5688 10.3391 4.3166 1.0972 0.6154 12.2618 8.2335 2.6552 14.8571 6.8008 58.2385 13.8095 15.1081 9.0162 13.2974 18.2176 10.7797 6.8271
temp: 298.150 k
press: 1.00000 atm
elementType: 16 16 16 6 6 6 1 1 1 1 1 1 1 1
symmnumber: 1
zpe: 260005.2 jmol-1
zpe.correction: 0.099031 hartree
zpe.thermalcorrener: 0.108209 hartree
zpe.thermalcorrenthalpy: 0.109153 hartree
zpe.thermalcorrgfe: 0.064047 hartree
zpe.sumelectzpe: -1312.767084 hartree
zpe.sumelectthermal: -1312.757906 hartree
zpe.sumelectthermalent: -1312.756961 hartree
zpe.sumelectthermalfe: -1312.802067 hartree
dipole: -0.7027 -1.6459 0.8474
dipole: 1.9801
quadrupole: -66.8476 -60.5319 -57.3485
quadrupole: -7.7193 -0.5759 -2.6830
quadrupole: -5.2716 1.0441 4.2275 -7.7193 -0.5759 -2.6830
hfenergy: -1312.8661144 hartree
pointgroup: C01 [X(C3H8S3)]
dipole: -0.1888363 -0.6424333 0.398157 debye
dipolederiv: -0.3450901 0.1043841 0.0933751 0.0447021 -0.1383051 0.15447 0.0711177 0.2040024 -0.0531633 -0.1961374 -0.0774835 0.0099212 -0.1297355 0.2681585 -0.012322 0.0449312 -0.0121023 -0.2520619 -0.3635793 -0.0642946 0.030948 -0.0892609 0.0936203 0.0306056 0.0388858 -0.0262392 -0.2060242 0.0385691 -0.0691126 0.0121809 -0.1582518 0.3044107 -0.1112593 -0.1700735 -0.3290661 0.1247294 0.3514522 0.0431663 0.0036787 0.0545636 -0.1200323 0.0067802 -0.0579837 0.0488326 0.0511047 0.2312513 0.1648009 0.116583 0.0957348 -0.0314996 -0.0165698 0.2192855 0.1196103 0.1960714 0.0168228 -0.0488137 -0.0868513 -0.0361311 0.0230271 -0.0265885 -0.0068592 -0.0035625 -0.0273624 -0.033152 -0.0632126 -0.0735912 -0.0410586 0.0656165 -0.0138593 -0.0178364 -0.0416333 -0.0219539 -0.0330141 0.0129173 0.0283419 0.0063023 -0.098022 0.1025253 0.0362011 0.0842065 0.0221387 0.0568247 -0.0277069 -0.0368265 -0.0323286 -0.0544442 0.1149842 -0.0534403 0.0812128 0.0186225 -0.0515942 0.0039344 0.0035029 0.0406362 0.0198386 -0.1192319 -0.0028217 -0.0791682 -0.0278121 0.1599803 0.004068 -0.0968616 -0.020365 -0.0270249 -0.1361256 -0.0453002 -0.044694 -0.0412728 -0.0160841 0.0183534 0.0381229 0.1652174 -0.1947925 -0.0179678 0.0173642 0.0111984 0.1603966 0.1837511 -0.0010005 -0.042524 0.099975 -0.1105511 0.044559 -0.0734707 -0.0125975 0.0565873 unknown
polarizability: 90.8377376|0.7164073|81.2250115|3.5148991|-3.8864363|64.7238162 unknown
InChI: InChI=1S/C3H8S3/c4-1-3(6)2-5/h3-6H,1-2H2
charge 0 multiplicity 1
14 atoms
S  -0.172972 1.769517 -0.371075
S  2.560445 -0.190665 -0.466152
S  -2.523083 -0.937516 -0.463738
C  -0.036356 0.13326 0.600358
C  0.82989 -0.903731 -0.125828
C  -1.423353 -0.416043 0.99107
H  0.479824 0.451458 1.526249
H  0.36418 -1.208255 -1.077765
H  0.94941 -1.791937 0.519846
H  -1.316423 -1.336005 1.593771
H  -1.97671 0.330717 1.581476
H  -0.534021 1.173205 -1.570786
H  3.184697 -1.428921 -0.548917
H  -2.846528 0.354317 -0.850009
