program: Gaussian 09
title: 000078510
version: EM64L-G09RevD.01
frameworkgroup: C1[X(C11H9NO)]
method: RPBEPBE
basis: SDD
operation: Freq
keyword: #p
keyword: freq=noraman
keyword: PBEPBE/SDD
title: #p freq=noraman PBEPBE/SDD
converged: NO NO NO NO
title: Mulliken charges:
elementType: O N C C C C C C C C C C C H H H H H H H H H
charge: -0.315988 -0.025109 0.420507 -0.355811 -0.355749 0.126672 -0.199274 -0.199295 -0.243860 -0.319208 -0.150539 -0.197287 -0.332477 0.246144 0.246135 0.227076 0.227073 0.259142 0.228285 0.240294 0.231605 0.241666
chargesum: 0.00000
title: Mulliken charges with hydrogens summed into heavy atoms:
elementType: O N C C C C C C C C C C C
charge: -0.315988 -0.025109 0.420507 -0.109667 -0.109615 0.126672 0.027801 0.027777 -0.015575 -0.060066 0.089755 0.034318 -0.090811
polarizability: 1.76343445e+02 -1.01706281e+01 9.71391133e+01 2.80619255e-02 1.31332627e-02 9.19688881e+01
1716.lowfreq: -30.9646 -5.2467 0.0000 0.0004 0.0006 6.9768 17.0481 49.3312 71.8751
frequency: -30.7530 49.2823 71.8612 179.7267 223.6629 298.3924 380.3506 409.2846 413.1295 462.1510 506.2090 562.4249 611.0055 611.5829 624.2729 691.8571 735.8655 745.4106 774.5388 785.1497 835.0310 859.1220 877.5002 913.9880 948.2277 952.7655 968.0368 988.2545 988.2877 990.4879 1018.7766 1031.2506 1072.6774 1088.2517 1156.0074 1159.5374 1169.7550 1182.9854 1240.0503 1289.3096 1302.4832 1334.4788 1382.4690 1410.9315 1439.2488 1439.9496 1472.8194 1562.8046 1577.5722 1603.0830 1605.4632 3128.1870 3134.6685 3138.3015 3145.8238 3153.8962 3163.6360 3171.4598 3172.1465 3183.0465
redmass: 4.2180 4.7808 5.3106 4.8109 4.6698 5.6272 5.8558 2.8735 3.5050 3.8164 2.9958 8.3380 6.5356 6.2760 5.0832 2.0022 2.7247 3.1287 1.5840 2.4367 1.2474 6.0673 1.3127 1.4862 1.4193 6.2977 1.3760 3.4799 1.3199 1.5829 2.1217 2.1905 1.4995 1.6073 1.0871 1.6136 1.0551 1.7930 4.2145 1.5160 1.3289 10.3130 9.8039 2.1172 2.2213 2.0597 2.3277 6.5358 5.8026 6.8739 6.2785 1.0848 1.0884 1.0892 1.0904 1.0934 1.0966 1.0959 1.1009 1.0998
irintensity: 0.3860 3.0611 2.1946 0.1372 0.7329 2.3910 5.2986 0.0815 2.7713 8.8360 4.0778 0.4717 0.2135 4.0289 2.8981 38.5079 10.7702 15.0344 83.4252 56.2114 0.0553 46.4539 0.4981 7.3145 1.2025 9.6155 0.1484 3.4873 0.3529 1.8188 16.1719 5.5804 11.8613 4.0449 7.4461 38.6753 0.0431 48.5311 377.2887 1.2040 0.1304 31.3986 0.4057 88.1733 4.0169 152.3478 70.9649 23.7810 171.9903 5.5634 7.6704 0.6211 11.0874 11.2349 13.1293 32.4045 17.8910 23.6002 5.6349 7.3710
temp: 298.150 k
press: 1.00000 atm
elementType: 8 7 6 6 6 6 6 6 6 6 6 6 6 1 1 1 1 1 1 1 1 1
symmnumber: 1
zpe: 444944.6 jmol-1
zpe.correction: 0.169470 hartree
zpe.thermalcorrener: 0.178764 hartree
zpe.thermalcorrenthalpy: 0.179708 hartree
zpe.thermalcorrgfe: 0.133927 hartree
zpe.sumelectzpe: -553.627086 hartree
zpe.sumelectthermal: -553.617793 hartree
zpe.sumelectthermalent: -553.616849 hartree
zpe.sumelectthermalfe: -553.662629 hartree
dipole: 1.3210 0.3075 -0.0002
dipole: 1.3563
quadrupole: -57.7068 -75.4654 -71.2915
quadrupole: -2.7600 0.0070 0.0122
quadrupole: 10.4477 -7.3108 -3.1369 -2.7600 0.0070 0.0122
hfenergy: -553.7965567 hartree
pointgroup: C01 [X(C11H9N1O1)]
dipole: 0.5195215 -0.1218725 -0.0000532 debye
dipolederiv: -2.1570876 0.1891736 -0.0000921 0.2007567 -0.4416315 0.0000815 0.0001761 0.0000803 -0.2807689 -0.6315823 -0.0055665 0.0000297 0.6130726 -0.5033891 0.0002104 -0.0003585 0.0002132 -0.1737279 1.4715108 0.1204693 -0.0000812 0.510909 0.1048501 0.0001 -0.0002636 0.0001019 0.2011191 -0.2970246 0.0432957 0.0594187 -0.0614408 -0.1189555 -0.001158 0.1236559 0.0552106 -0.0124904 -0.296933 0.0431845 -0.0595856 -0.0618949 -0.1190799 0.001458 -0.1237403 -0.054959 -0.0124761 1.8852236 -0.4702065 0.0002782 -0.8414901 0.4472021 -0.0002385 0.0002306 -0.0001885 0.1395469 0.0065129 0.067925 -0.0507092 0.0902728 -0.1106106 -0.0223565 -0.04636 -0.0311066 0.0997119 0.0065274 0.0679999 0.0505119 0.0903811 -0.1104746 0.0228821 0.0460424 0.031605 0.0996734 0.0217237 0.104128 -0.0000749 0.0774136 -0.1300079 0.0000659 -0.0000025 0.0000727 -0.1021809 -0.6398581 0.2299247 -0.0001465 -0.0579868 0.0318447 -0.0001017 0.0000511 -0.0001083 -0.1480429 0.2604983 -0.040904 0.0000125 -0.0845985 0.2556464 -0.0002349 0.0000458 -0.0002228 -0.1146064 -0.1608784 -0.221977 0.0001437 0.0094082 -0.2790806 0.0000867 -0.0000002 0.0000813 -0.1624557 0.3532855 0.149535 -0.000126 -0.22065 0.3895684 -0.0002837 0.0000996 -0.0002951 -0.0805427 0.084435 -0.052767 -0.080642 -0.0500503 0.1335498 -0.0241223 -0.0895971 -0.0250171 -0.01435 0.0843198 -0.0526036 0.0808066 -0.0498665 0.1336388 0.0237459 0.0897793 0.0246655 -0.0143758 0.0258607 -0.0385257 0.08015 -0.0537332 0.1402695 0.0324637 0.0974593 0.0315916 -0.0707301 0.0259635 -0.0386776 -0.0799783 -0.053932 0.1401213 -0.0329715 -0.0972804 -0.0320796 -0.0706769 0.1173408 0.0050489 0.0000035 -0.001443 -0.0553058 0.0001412 0.0000009 0.0001288 0.1724682 -0.0955761 -0.1014542 0.0000657 -0.1137235 0.1211804 -0.0000701 0.0000741 -0.0000667 0.0874909 -0.0722926 -0.0856024 0.0000617 -0.0858409 0.0527856 0.0000628 0.0000611 0.0000619 0.1488171 -0.0615191 0.0973947 -0.000051 0.0913955 0.0342565 0.0000835 -0.0000394 0.0000816 0.1762213 0.06955 -0.0097948 0.0000046 0.0530409 -0.1163782 0.0001555 -0.0000343 0.0001494 0.1323758 unknown
polarizability: 176.3784507|10.0333613|97.1040717|-0.0182954|0.0187274|91.9689244 unknown
InChI: InChI=1S/C11H9NO/c1-2-6-10(7-3-1)13-11-8-4-5-9-12-11/h1-9H
charge 0 multiplicity 1
22 atoms
O  0.099058 1.201816 -0.000546
N  1.203107 -0.901939 0.000643
C  -1.165609 0.531743 -0.000222
C  -1.796996 0.263173 1.230171
C  -1.796274 0.260454 -1.230395
C  1.278196 0.446411 -0.000184
C  -3.09415 -0.29705 1.224471
C  -3.093428 -0.299755 -1.224217
C  -3.744996 -0.579233 0.000248
C  2.492239 1.181622 -0.000695
C  3.692676 0.446063 -0.000299
C  3.64534 -0.97282 0.00058
C  2.380072 -1.596929 0.001015
H  -1.277137 0.489601 2.166461
H  -1.275875 0.484789 -2.166889
H  -3.594704 -0.510531 2.175538
H  -3.593419 -0.515353 -2.175102
H  2.469266 2.274123 -0.001358
H  -4.751608 -1.011481 0.000432
H  4.653718 0.97127 -0.000664
H  4.558683 -1.574781 0.000918
H  2.286541 -2.688794 0.001694
