program: Gaussian 09
title: 000078537
version: EM64L-G09RevD.01
frameworkgroup: C1[X(C11H15NO4S)]
method: RPBEPBE
basis: SDD
operation: Freq
keyword: #p
keyword: freq=noraman
keyword: PBEPBE/SDD
title: #p freq=noraman PBEPBE/SDD
converged: YES YES NO NO
title: Mulliken charges:
elementType: S O O O O N C C C C C C C C C C C H H H H H H H H H H H H H H H
charge: 0.290478 -0.368524 -0.299907 -0.255732 -0.265738 -0.593274 0.440801 0.116759 -0.475372 -0.255683 -0.784807 0.214988 0.274245 -0.204889 -0.212389 -0.688311 -0.674691 0.243150 0.281285 0.243034 0.395398 0.318022 0.232308 0.232547 0.227235 0.226947 0.223993 0.225069 0.224808 0.209532 0.229356 0.229361
chargesum: 0.00000
title: Mulliken charges with hydrogens summed into heavy atoms:
elementType: S O O O O N C C C C C C C C C C C
charge: 0.290478 -0.368524 -0.299907 -0.255732 -0.265738 0.120146 0.440801 0.116759 -0.475372 -0.255683 -0.017338 0.214988 0.274245 0.259966 0.241793 -0.014441 -0.006442
polarizability: 2.63848522e+02 -1.44739140e+00 1.72610633e+02 -8.21662129e-04 5.11834773e-02 8.58362919e+01
1716.lowfreq: -7.6098 -1.2928 -0.0001 0.0007 0.0012 5.6417 26.5493 37.6466 58.4649
frequency: 26.5282 37.2107 58.3972 71.0373 71.4705 85.0979 90.9791 115.9334 134.3537 143.7407 158.2498 197.8026 236.1434 246.8522 253.0220 263.3904 284.2415 297.3376 328.0997 337.7741 354.3550 376.0164 392.5044 425.2127 431.6135 490.8307 540.2349 540.4564 620.3714 621.2479 684.0764 707.2476 719.8938 747.2129 755.1031 799.6328 800.2721 804.3008 828.5268 871.6485 952.5029 1004.5152 1015.7499 1034.0473 1041.3924 1045.6643 1109.8230 1112.0616 1112.7187 1136.4153 1138.5071 1171.9229 1233.7890 1248.3500 1249.0034 1330.7453 1354.5055 1359.4812 1397.5487 1399.1851 1401.8181 1421.0124 1443.8856 1463.6336 1467.8676 1474.6167 1475.0367 1475.9807 1487.5265 1488.1668 1516.3203 1552.7196 1595.0929 1603.6366 1627.4578 2991.3397 2995.2832 2999.0445 3007.2436 3015.8124 3064.8255 3071.1806 3073.4825 3089.4520 3091.6624 3102.0319 3106.6302 3132.4608 3420.3496 3650.4332
redmass: 3.3333 3.3660 2.1888 4.0825 4.9281 6.3818 3.0395 4.1098 2.7927 4.0499 1.0448 5.5582 2.1756 1.2357 4.7868 1.6865 3.2871 5.5188 6.3995 3.8911 5.3525 5.8767 4.3382 1.2996 5.9055 7.5611 3.8284 5.4074 6.3423 6.6100 1.2414 9.9485 6.0555 5.8737 6.6352 1.1010 1.1004 4.0105 3.5969 3.3558 7.3107 3.2101 1.9096 3.1536 1.5226 4.6095 2.2176 2.2594 2.4010 1.4620 1.4686 2.9586 4.6709 1.1339 1.1298 2.8849 1.6492 1.5212 1.2700 1.2298 1.2680 3.8786 1.2615 1.0402 1.0410 1.0456 1.0586 1.0572 1.0727 1.0759 2.8137 5.4342 1.9663 4.5106 9.5647 1.0357 1.0359 1.0376 1.0580 1.0582 1.1067 1.1055 1.0954 1.0983 1.0985 1.1040 1.1024 1.1006 1.0533 1.0961
irintensity: 0.1529 0.3840 1.2934 0.9361 0.2706 1.3572 0.6254 0.9673 9.5723 1.7793 0.0104 2.3892 3.0366 0.0007 0.7997 0.1566 0.8059 8.5820 4.3449 32.4915 1.7102 1.1437 6.8330 105.7809 4.5489 0.3242 30.3059 4.2634 14.6929 12.8528 99.5945 7.7902 5.8792 29.5469 7.4895 3.9749 3.3471 30.4669 1.5927 33.5010 244.1823 31.7398 41.9452 445.2547 5.4015 89.5380 0.4605 46.4613 61.1606 5.4425 5.1734 360.3214 289.4290 0.0082 0.0043 8.2330 18.8930 1.0572 45.1604 37.4331 19.8290 240.8625 57.2162 11.7952 12.6891 14.8404 11.0486 9.1311 5.9114 8.4559 199.6370 127.0250 475.4668 240.4867 330.7894 20.8550 24.8865 6.8836 27.0077 20.7872 9.8473 1.1643 9.2239 34.7590 34.6979 51.6075 45.9938 3.5001 232.1217 90.2344
temp: 298.150 k
press: 1.00000 atm
elementType: 16 8 8 8 8 7 6 6 6 6 6 6 6 6 6 6 6 1 1 1 1 1 1 1 1 1 1 1 1 1 1 1
symmnumber: 1
zpe: 650184.4 jmol-1
zpe.correction: 0.247642 hartree
zpe.thermalcorrener: 0.266815 hartree
zpe.thermalcorrenthalpy: 0.267759 hartree
zpe.thermalcorrgfe: 0.198947 hartree
zpe.sumelectzpe: -1180.608193 hartree
zpe.sumelectthermal: -1180.589020 hartree
zpe.sumelectthermalent: -1180.588076 hartree
zpe.sumelectthermalfe: -1180.656889 hartree
dipole: 2.6906 -5.1303 -0.0067
dipole: 5.7930
quadrupole: -80.9284 -108.2705 -108.3938
quadrupole: -4.0415 -0.0058 0.0495
quadrupole: 18.2691 -9.0729 -9.1962 -4.0415 -0.0058 0.0495
hfenergy: -1180.8558352 hartree
pointgroup: C01 [X(C11H15N1O4S1)]
dipole: 1.0640872 -2.0149137 -0.048734 debye
polarizability: 263.8196963|-1.1500858|172.5806688|-2.5585019|1.3992314|85.8950821 unknown
InChI: InChI=1S/C11H15NO4S/c1-4-15-10(13)7-6(3)8(17-9(7)12)11(14)16-5-2/h4-5,12H2,1-3H3
charge 0 multiplicity 1
32 atoms
S  -1.011777 -1.601004 -0.110927
O  3.409599 -0.354321 -0.152936
O  -3.593113 -0.439816 -0.055471
O  2.740844 1.879506 -0.11018
O  -3.128745 1.853254 -0.023475
N  1.639242 -2.319258 -0.160431
C  -0.142945 0.946362 -0.081876
C  1.051398 0.112444 -0.112863
C  -1.327212 0.206811 -0.076976
C  0.756947 -1.279094 -0.131667
C  -0.105376 2.455281 -0.057849
C  2.407208 0.667596 -0.123624
C  -2.71215 0.662744 -0.049691
C  4.81911 0.133152 -0.164458
C  -5.045388 -0.107819 -0.028305
C  5.721195 -1.098204 -0.187525
C  -5.800785 -1.43331 -0.029267
H  0.439383 2.838933 -0.938621
H  -1.12255 2.870261 -0.036547
H  0.464008 2.810502 0.819305
H  2.634915 -2.069029 -0.170553
H  1.328514 -3.287338 -0.176956
H  4.957539 0.773429 -1.053686
H  4.978357 0.755355 0.734003
H  -5.249617 0.495065 0.875309
H  -5.278711 0.512536 -0.912917
H  6.780019 -0.781814 -0.195047
H  5.559473 -1.727263 0.705413
H  5.540851 -1.70779 -1.090344
H  -6.889601 -1.243564 -0.010439
H  -5.565468 -2.020095 -0.933711
H  -5.537465 -2.037313 0.855913
