program: Gaussian 09
title: 000078518
version: EM64L-G09RevD.01
frameworkgroup: C1[X(C11H10ClNO2)]
method: RPBEPBE
basis: SDD
operation: Freq
keyword: #p
keyword: freq=noraman
keyword: PBEPBE/SDD
title: #p freq=noraman PBEPBE/SDD
converged: NO YES NO NO
title: Mulliken charges:
elementType: Cl O O N C C C C C C C C C C C H H H H H H H H H H
charge: -0.070953 -0.312508 -0.229935 -0.450286 0.299826 0.234879 0.242278 -0.474084 -0.390056 -0.340490 0.152630 -0.108134 -0.194851 -0.212533 -0.675420 0.284779 0.338016 0.269952 0.243117 0.254482 0.232426 0.232373 0.217649 0.228412 0.228429
chargesum: 0.00000
title: Mulliken charges with hydrogens summed into heavy atoms:
elementType: Cl O O N C C C C C C C C C C C
charge: -0.070953 -0.312508 -0.229935 -0.112270 0.299826 0.234879 0.242278 -0.189304 -0.120103 -0.097373 0.152630 -0.108134 0.059631 0.252266 -0.000929
polarizability: 2.64368952e+02 -9.40385744e+00 1.38468031e+02 -3.24078507e-02 -3.02160169e-02 6.40896105e+01
1716.lowfreq: -3.9706 -2.7615 -0.0029 0.0006 0.0010 8.8140 31.2372 53.7778 66.6290
frequency: 31.1749 53.7657 66.6276 89.8991 114.1964 167.8937 172.6365 238.9277 243.7543 272.7039 283.8638 333.2766 340.1914 384.2453 424.0394 430.1880 518.5338 576.5240 598.4725 602.9825 615.0691 669.6045 719.9264 746.2546 748.1838 798.9595 799.4615 806.4388 836.6280 841.8414 888.2127 896.0113 937.6291 952.4372 1026.5682 1051.7090 1063.4421 1111.9234 1132.3040 1136.7106 1162.3204 1225.3440 1235.4536 1249.2773 1279.6483 1315.9430 1359.3933 1385.7905 1400.7962 1411.9999 1452.5052 1463.7352 1466.1633 1475.2786 1487.0846 1537.3114 1577.0596 1626.6045 1643.7510 2996.3877 3012.5943 3070.5536 3093.5264 3106.9658 3147.2453 3171.4108 3175.7257 3235.5174 3605.8956
redmass: 3.7027 2.8200 4.7436 7.8711 3.3460 7.0358 4.2761 5.9989 1.3460 3.7182 8.7912 4.9269 6.8086 4.7063 6.9257 3.0245 4.6166 4.4421 4.7245 6.3419 1.1203 7.8379 4.3668 3.7065 7.7902 1.2953 1.2940 3.9652 3.5812 1.3942 1.5497 5.1583 1.3334 6.5247 2.3583 2.1588 3.2340 2.2059 1.3993 1.4683 1.7765 1.4055 2.4662 1.1314 1.8623 2.9894 1.5193 5.4454 1.3051 2.7718 5.1576 1.0407 4.6830 1.0594 1.0754 6.6833 6.3864 7.8900 11.7004 1.0357 1.0582 1.1065 1.0985 1.1029 1.0896 1.0936 1.0963 1.0986 1.0809
irintensity: 0.0446 0.6756 0.0276 0.2718 1.5341 2.0092 0.9841 5.0226 0.0889 2.9601 1.2702 10.4589 0.2155 2.9907 13.4081 12.5280 4.5336 0.7218 5.6870 4.3434 78.4039 38.0779 32.0822 2.2113 7.2731 16.4523 40.6207 2.5062 3.1261 12.3750 47.4460 19.8462 1.4148 79.1862 60.0535 86.6738 210.8735 3.8922 16.1154 5.6691 363.8139 107.9892 103.9799 0.0067 12.5468 69.8791 7.3098 38.4531 13.6699 20.3816 7.2696 12.6496 15.6827 7.1875 8.4955 102.8137 2.2619 14.6019 404.0630 21.0645 21.9627 5.8570 31.8930 46.6216 4.3906 1.5465 3.8332 0.5503 99.3809
temp: 298.150 k
press: 1.00000 atm
elementType: 17 8 8 7 6 6 6 6 6 6 6 6 6 6 6 1 1 1 1 1 1 1 1 1 1
symmnumber: 1
zpe: 491034.1 jmol-1
zpe.correction: 0.187025 hartree
zpe.thermalcorrener: 0.200743 hartree
zpe.thermalcorrenthalpy: 0.201688 hartree
zpe.thermalcorrgfe: 0.145091 hartree
zpe.sumelectzpe: -1089.378355 hartree
zpe.sumelectthermal: -1089.364637 hartree
zpe.sumelectthermalent: -1089.363693 hartree
zpe.sumelectthermalfe: -1089.420289 hartree
dipole: 3.2353 3.5827 -0.0020
dipole: 4.8273
quadrupole: -92.0329 -89.5104 -96.9407
quadrupole: 8.5620 0.0072 -0.0088
quadrupole: 0.7951 3.3176 -4.1127 8.5620 0.0072 -0.0088
hfenergy: -1089.5653802 hartree
pointgroup: C01 [X(C11H10Cl1N1O2)]
dipole: -1.2322509 1.4451804 0.0011123 debye
dipolederiv: -0.9236611 0.0814518 0.0006992 0.1879227 -0.147666 -0.0001822 0.0008282 -0.0000942 -0.0782527 -1.7161546 0.4183081 -0.0004694 0.9594522 -0.8712717 -0.0000364 -0.0021982 0.0009801 -0.2926923 -1.0200068 -0.2760914 0.0005246 -0.3502626 -0.9391891 0.0010449 -0.0008917 -0.0011724 -0.3153909 -0.428095 0.010961 0.0001511 0.3860044 -0.4646882 -0.0003716 0.000565 -0.0000378 -0.2450962 -0.084091 -0.0628764 -0.0000438 0.0785807 -0.1116426 -0.0001064 0.00012 0.0000642 0.0089427 0.2811708 -0.0684403 -0.0003414 -0.2435767 -0.1040633 0.0000397 -0.0001544 -0.0000502 0.0532471 -1.364437 -0.1734302 0.0004723 -0.0845465 0.4137113 0.0004041 0.0011148 0.0002683 0.0027407 0.2826604 0.2329895 -0.0002251 -0.0837108 -0.001878 0.0001394 0.0001288 -0.000009 -0.204945 -0.0559993 0.0992748 0.0000476 0.0145083 0.0364188 0.0000496 -0.0001918 -0.0000211 -0.1163577 0.1307271 0.1122335 -0.0001599 0.1419063 0.1169327 0.0001241 -0.0002766 0.0000508 -0.1800549 2.6774563 0.0608355 -0.000694 -0.3744983 1.4433979 -0.0010623 0.0005728 0.0003596 0.2458512 1.2443851 -0.2034254 -0.0011807 -0.5538758 0.0208482 0.0004236 -0.0014225 0.0001974 -0.0787741 -0.4855847 -0.0384174 0.0001982 0.1511573 0.0806188 0.0000169 0.0003679 0.0001564 -0.1226133 1.1321102 -0.2307725 0.0003899 -0.1684337 0.2902817 -0.0000773 0.0009117 -0.0003252 0.3543061 -0.0800699 0.0907667 -0.0000653 0.0695707 -0.0676962 0.0001897 -0.000157 0.0001934 0.0653219 0.0975519 -0.0160361 0.0000701 -0.0287038 0.025513 -0.0000932 0.0000567 -0.0000965 0.1894786 0.289896 -0.026911 0.0001125 -0.0412533 0.2157069 0.0000328 0.0001014 -0.0000084 0.3243373 0.0810489 0.0219548 0.0000891 0.0529631 -0.0096188 -0.0001472 0.0001208 -0.0001369 0.1703748 0.0480083 0.071715 0.0001537 0.0214641 -0.0669653 -0.0001771 0.0001361 -0.000196 0.1769678 0.0200286 -0.0816032 0.00007 -0.0629757 0.0304512 -0.0000268 0.000098 -0.0000094 0.1673586 -0.0860183 0.0407376 -0.0120167 -0.0367794 0.0043688 -0.0909693 -0.0538747 -0.0854431 -0.0566229 -0.0862719 0.040496 0.0121332 -0.0369993 0.0045285 0.0908928 0.0539678 0.0855317 -0.0567283 -0.1895545 0.0148181 -0.0002941 0.0043792 0.076053 -0.0000113 -0.0003744 0.0000373 0.1174248 0.1175834 -0.0591882 -0.0730313 -0.0010635 0.0128229 -0.0830466 -0.0492456 -0.102023 -0.0644673 0.1173171 -0.0593503 0.0734102 -0.0012295 0.0130254 0.0829501 0.0496968 0.1017841 -0.0643558 unknown
polarizability: 264.8019335|5.8075189|138.0350109|-0.095276|0.0267716|64.0896486 unknown
InChI: InChI=1S/C11H10ClNO2/c1-2-15-11(14)10-6-7-5-8(12)3-4-9(7)13-10/h3-6,13H,2H2,1H3
charge 0 multiplicity 1
25 atoms
Cl 5.447694 -0.364953 -0.003305
O  -3.093695 0.363509 0.001768
O  -2.897893 -1.976846 0.001065
N  -0.422262 0.751674 0.002298
C  1.356139 -0.684789 -0.000039
C  0.967936 0.709262 0.001093
C  -0.924199 -0.560835 0.002028
C  0.146857 -1.464731 0.000392
C  2.737917 -1.026706 -0.001363
C  1.921896 1.753239 0.000938
C  -2.36236 -0.842525 0.003275
C  3.659831 0.024578 -0.001546
C  3.28314 1.397999 -0.000442
C  -4.580698 0.219917 0.000023
C  -5.163841 1.628688 -0.001394
H  0.047177 -2.547922 -0.000243
H  -1.022748 1.574507 0.003406
H  3.067535 -2.068969 -0.002279
H  1.625991 2.807089 0.001812
H  4.057638 2.170025 -0.000657
H  -4.870103 -0.360125 -0.89474
H  -4.872223 -0.359212 0.894689
H  -6.267511 1.573968 -0.00266
H  -4.847714 2.18974 0.894743
H  -4.845606 2.188818 -0.897362
