program: Gaussian 09
title: 000078511
version: EM64L-G09RevD.01
frameworkgroup: C1[X(C11H7Cl2NO)]
method: RPBEPBE
basis: SDD
operation: Freq
keyword: #p
keyword: freq=noraman
keyword: PBEPBE/SDD
title: #p freq=noraman PBEPBE/SDD
converged: YES YES NO NO
title: Mulliken charges:
elementType: Cl Cl O N C C C C C C C C C C C H H H H H H H
charge: -0.018585 -0.045624 -0.295209 -0.025332 0.518942 -0.254220 -0.319273 0.152317 -0.211557 -0.204247 -0.100936 -0.314752 -0.148084 -0.191293 -0.327473 0.260113 0.280711 0.260874 0.261715 0.242972 0.233989 0.244952
chargesum: 0.00000
title: Mulliken charges with hydrogens summed into heavy atoms:
elementType: Cl Cl O N C C C C C C C C C C C
charge: -0.018585 -0.045624 -0.295209 -0.025332 0.518942 -0.254220 -0.059159 0.152317 0.069155 0.056627 -0.100936 -0.053037 0.094889 0.042695 -0.082522
polarizability: 2.18051690e+02 -1.26356008e+01 1.10734640e+02 8.53485722e+00 6.55415972e+00 1.03970645e+02
1716.lowfreq: -7.0893 -0.9503 0.0014 0.0015 0.0040 7.6069 28.8497 44.6083 49.0866
frequency: 28.8126 44.5957 49.0841 126.3370 162.7868 167.9063 183.1816 259.1803 264.5225 314.5152 370.4546 413.7519 430.5772 448.5978 474.0661 507.7323 531.7835 601.0627 611.6866 641.8160 684.0243 717.1480 736.2842 774.4304 782.4502 823.7985 861.6657 863.7918 879.9271 946.5567 950.4532 955.7911 990.7857 1024.7528 1033.6890 1074.8139 1089.0780 1132.0835 1157.0548 1196.8902 1227.1925 1241.4168 1290.3258 1338.3752 1360.4287 1376.6545 1413.5191 1439.0046 1453.2543 1568.3791 1575.2207 1579.1582 1591.4906 3140.9255 3151.0286 3165.3770 3175.2177 3182.3498 3185.6647 3186.6577
redmass: 8.7703 5.9745 5.9389 6.9443 6.8471 7.3710 10.1307 9.2456 8.5308 7.3113 10.1608 3.4880 4.2158 5.2550 5.4482 3.3972 5.8462 7.6891 5.1901 7.3347 6.4047 4.6208 2.7319 1.8277 3.3636 1.6580 1.6119 4.1611 1.3123 1.3889 1.4207 5.9039 1.3257 3.9472 2.2965 2.3039 1.6206 1.3555 1.0867 3.2663 3.4275 1.4573 1.4912 9.2925 5.2113 5.1346 2.1785 2.0699 2.6947 6.7742 6.2285 8.7279 6.9166 1.0882 1.0908 1.0890 1.0962 1.0937 1.0974 1.1000
irintensity: 0.8813 1.4524 0.2967 1.9662 0.1641 0.1851 1.2058 1.7002 3.3192 0.1057 2.6349 3.2288 5.4325 11.0440 10.9558 3.1640 5.7296 2.6808 4.4800 3.5504 18.0191 20.5289 13.5310 54.1006 69.3256 46.6600 9.7643 33.0363 0.3621 0.3427 1.0629 6.9612 0.2475 49.0343 22.4738 56.2787 4.5185 5.0119 9.1795 9.4116 322.0242 81.8617 2.1257 21.8079 4.1391 11.3111 91.1355 203.9605 129.9030 22.8664 67.0547 13.1394 69.9642 8.2501 12.2175 2.0144 21.2955 0.1515 1.6826 6.6230
temp: 298.150 k
press: 1.00000 atm
elementType: 17 17 8 7 6 6 6 6 6 6 6 6 6 6 6 1 1 1 1 1 1 1
symmnumber: 1
zpe: 394466.0 jmol-1
zpe.correction: 0.150244 hartree
zpe.thermalcorrener: 0.162985 hartree
zpe.thermalcorrenthalpy: 0.163929 hartree
zpe.thermalcorrgfe: 0.108819 hartree
zpe.sumelectzpe: -1472.402324 hartree
zpe.sumelectthermal: -1472.389583 hartree
zpe.sumelectthermalent: -1472.388639 hartree
zpe.sumelectthermalfe: -1472.443749 hartree
dipole: -2.9547 -1.2520 -0.0600
dipole: 3.2095
quadrupole: -86.7527 -97.1203 -98.0309
quadrupole: 0.0200 -2.2907 2.4223
quadrupole: 7.2152 -3.1523 -4.0629 0.0200 -2.2907 2.4223
hfenergy: -1472.552568 hartree
pointgroup: C01 [X(C11H7Cl2N1O1)]
dipole: 1.1764818 0.3808441 -0.2556117 debye
dipolederiv: -0.2850393 0.2485986 -0.0923562 0.2649848 -0.4403726 0.1933532 -0.1251145 0.2168284 -0.1476125 -0.8258807 0.1325982 0.1590368 0.1298546 -0.1231463 0.0055105 0.2342724 -0.005766 -0.1388776 -2.104105 -0.1455211 -0.2231568 0.0338589 -0.2771539 -0.0565155 -0.3323662 -0.081735 -0.4271807 -0.593579 0.0172765 -0.0074481 -0.2704084 -0.2729177 -0.1643436 -0.5311651 -0.1689378 -0.4312798 1.3816112 0.1247705 -0.098981 -0.1397724 -0.0334418 0.0603475 -0.3683025 0.0520955 0.0545351 0.215858 -0.43326 0.1215353 -0.3541389 0.6085332 -0.3078704 0.2438828 -0.3702787 0.1579392 -0.1425564 -0.0949351 -0.0346299 0.0047502 -0.0116684 -0.0890664 -0.0541477 -0.0397919 -0.0355998 1.8064189 0.2664508 0.4474945 0.2812015 0.2442739 0.1242803 0.874582 0.1923496 0.4277946 -0.3819832 0.1592107 -0.0043232 0.1161824 -0.1864401 0.0273351 0.0268431 0.0358084 -0.0710188 -0.3196641 -0.0009686 0.0574295 -0.0379302 -0.0458384 -0.0426867 0.0891232 -0.0533374 -0.1026167 1.1653151 -0.2205259 -0.3008023 -0.2083406 0.1080335 -0.0590422 -0.3773846 -0.0566951 0.1204365 -0.6163177 -0.1313188 -0.2193353 0.0136255 -0.0867032 0.08917 -0.0181983 0.0560698 -0.0265365 0.2575898 -0.0089463 0.0378644 0.0203273 -0.0178254 0.1488395 0.0910795 0.1587619 0.1504945 -0.1531413 0.1073982 0.2006815 -0.0032313 -0.187459 -0.0509464 -0.0041411 -0.047605 -0.2048263 0.3142858 -0.1038072 -0.1110938 0.0832329 0.0465341 0.2094907 0.2062798 0.2014652 0.272193 0.0776369 -0.0108795 0.0714905 -0.0193735 0.0717071 0.0742508 0.077424 0.0760352 0.0733764 0.0814974 -0.0084741 0.033 -0.0052883 0.0996369 0.0641964 0.0440205 0.0657785 0.0983307 0.046938 0.0683664 -0.0198242 0.0741556 0.0593348 0.0693039 -0.0063871 0.0673121 0.1148695 0.1233533 0.0094203 0.0008131 0.0110043 0.1121367 -0.0953655 0.0059218 -0.0926432 0.0116986 -0.077673 0.0482187 0.0552127 0.0519564 0.1218898 -0.0368492 0.0518078 -0.0382956 0.0924045 -0.0420133 -0.0390687 -0.092987 -0.0300771 0.1415637 -0.0594104 -0.0919433 -0.0620433 0.0550103 0.0714486 0.0153964 0.0203796 -0.0165735 0.0693231 -0.1039817 -0.0360865 -0.1053755 -0.0435342 unknown
polarizability: 216.5596013|-19.8225341|105.5153888|-3.2980521|-6.3179718|110.6819855 unknown
InChI: InChI=1S/C11H7Cl2NO/c12-8-4-5-10(9(13)7-8)15-11-3-1-2-6-14-11/h1-7H
charge 0 multiplicity 1
22 atoms
Cl -0.344911 -2.287517 0.982816
Cl -5.053086 0.631814 0.638781
O  0.604363 -0.346182 -1.226851
N  1.549466 0.669839 0.701658
C  -0.690287 -0.085817 -0.71137
C  -1.284391 -0.916028 0.26595
C  -1.444309 0.956349 -1.286808
C  1.729876 -0.018298 -0.441895
C  -2.610689 -0.705148 0.689175
C  -2.778102 1.184571 -0.885469
C  -3.336011 0.350085 0.101977
C  2.986322 -0.427521 -0.949369
C  4.123855 -0.084233 -0.193631
C  3.968022 0.638135 1.018161
C  2.664477 0.990455 1.424288
H  -0.972263 1.584297 -2.047695
H  -3.060936 -1.348629 1.448799
H  -3.364553 1.993301 -1.328733
H  3.04578 -0.988319 -1.884987
H  5.119528 -0.378408 -0.541225
H  4.831138 0.917432 1.628834
H  2.487108 1.546021 2.351392
