program: Gaussian 09
title: 000078494
version: EM64L-G09RevD.01
frameworkgroup: C1[X(C8H8O2)]
method: RPBEPBE
basis: SDD
operation: Freq
keyword: #p
keyword: freq=noraman
keyword: PBEPBE/SDD
title: #p freq=noraman PBEPBE/SDD
converged: YES YES NO NO
title: Mulliken charges:
elementType: O O C C C C C C C C H H H H H H H H
charge: -0.183244 -0.202499 0.441463 -0.500493 0.018422 -0.494541 -0.679169 0.174628 -0.252483 -0.276979 0.240428 0.215293 0.273208 0.226303 0.248768 0.218695 0.264848 0.267351
chargesum: 0.00000
title: Mulliken charges with hydrogens summed into heavy atoms:
elementType: O O C C C C C C C C
charge: -0.183244 -0.202499 0.441463 -0.044772 0.018422 -0.221333 0.014598 0.174628 0.012365 -0.009627
polarizability: 1.29565101e+02 -1.89674558e+01 9.44718367e+01 4.80414260e+00 1.78470658e+00 4.88115918e+01
1716.lowfreq: -9.9857 -8.1815 -0.0007 -0.0007 -0.0006 3.3087 61.1376 89.7144 129.9555
frequency: 61.0102 89.7109 129.9453 205.0770 229.2733 286.7145 305.1745 378.3889 421.9521 450.3183 478.1085 562.9247 622.2385 668.0402 738.9469 784.6467 803.2535 840.6748 865.8413 920.3357 958.3835 996.8350 1039.8525 1064.9783 1099.0182 1149.8671 1216.8453 1245.6760 1287.9305 1306.8008 1343.9938 1362.3212 1386.6272 1461.0430 1473.5147 1488.3093 1525.6119 1557.6644 1599.4998 1646.8356 2990.6061 3004.0874 3061.4713 3089.0889 3102.7109 3140.6432 3143.6523 3169.6136
redmass: 2.6985 6.1045 4.2216 1.2347 3.9399 2.9736 2.5391 7.5142 6.0828 4.4096 4.7068 3.8318 3.0822 4.7930 2.5888 2.6250 1.5520 2.1945 3.2663 1.5762 2.2837 1.2994 2.3987 1.6267 1.4784 1.9658 1.4859 1.3942 2.4457 1.4584 1.8170 2.3995 1.2555 1.1011 1.0518 1.0615 10.4137 8.3548 7.9709 7.1166 1.0348 1.0589 1.1022 1.1006 1.1015 1.0929 1.0870 1.1011
irintensity: 0.2050 11.1896 1.7392 0.1114 0.5461 0.3316 0.2795 18.7128 5.3044 2.0075 0.6386 0.7435 1.9262 3.5484 0.9374 1.7368 7.6676 24.9490 5.3313 48.4016 12.9096 0.2158 51.8709 2.5273 17.3710 5.7643 1.8756 0.2842 70.1950 4.2449 15.5903 3.9891 14.2518 9.0395 17.1795 13.5965 1.2133 250.5172 54.8983 10.5748 31.8765 19.3931 3.8022 34.0830 24.8368 6.1814 0.6777 7.2821
temp: 298.150 k
press: 1.00000 atm
elementType: 8 8 6 6 6 6 6 6 6 6 1 1 1 1 1 1 1 1
symmnumber: 1
zpe: 363401.9 jmol-1
zpe.correction: 0.138412 hartree
zpe.thermalcorrener: 0.147722 hartree
zpe.thermalcorrenthalpy: 0.148666 hartree
zpe.thermalcorrgfe: 0.103633 hartree
zpe.sumelectzpe: -459.341216 hartree
zpe.sumelectthermal: -459.331907 hartree
zpe.sumelectthermalent: -459.330962 hartree
zpe.sumelectthermalfe: -459.375995 hartree
dipole: -1.0631 -0.0596 0.0650
dipole: 1.0668
quadrupole: -65.6696 -59.7614 -58.4003
quadrupole: 13.5564 0.2888 1.9113
quadrupole: -4.3925 1.5157 2.8768 13.5564 0.2888 1.9113
hfenergy: -459.4796289 hartree
pointgroup: C01 [X(C8H8O2)]
dipole: -0.4162143 0.0393394 -0.0368813 debye
dipolederiv: -0.7612953 -0.1786205 0.0079322 -0.1883214 -0.613758 -0.0188273 0.0087052 -0.0225762 -0.314717 -0.8454391 -0.1358215 0.0016258 -0.208985 -0.5563161 -0.0229283 0.0134749 -0.0274642 -0.3415201 0.5261875 -0.1364177 -0.0075102 -0.1705341 -0.3225754 -0.0616462 -0.0946678 -0.0390176 -0.0722245 -0.1994037 0.0709446 -0.0366253 0.0614919 0.0846828 0.0274882 -0.1710372 0.0489291 0.0377489 0.8642322 0.0653172 -0.0590489 0.120377 0.7984203 0.0958166 -0.0392808 0.1008898 0.2271185 -0.6681037 0.1932741 0.0265849 0.1376162 0.0902856 0.0335464 0.08918 0.0133904 -0.1208782 0.0437661 0.01279 -0.0368211 0.0405757 0.0498027 -0.0082009 0.1356775 -0.0573454 0.0394911 1.0761629 -0.0025615 -0.0426966 -0.0556083 0.7891844 0.0873361 -0.0954653 0.1063101 0.2647676 -0.3856262 0.1089029 0.0473141 0.1526911 0.1131597 0.0287628 0.0644236 0.0330979 -0.113022 0.1736727 -0.0455884 -0.0419404 -0.0113678 -0.3481292 -0.0320897 -0.0395371 -0.0418396 -0.116075 0.0402723 -0.0159095 0.0545646 -0.0446801 0.0268758 0.1012078 0.0490127 0.0539001 0.0064601 0.0257201 -0.0396712 -0.0495437 0.025856 -0.0802132 -0.1177195 -0.0015359 -0.0773185 0.0117897 0.0735046 0.0231111 0.0167815 0.0433101 -0.0488988 -0.042204 0.0190162 -0.0397404 0.132885 -0.1681075 0.1105219 0.0117156 0.121315 0.0624056 -0.0055664 -0.0022751 -0.0088998 0.0614923 0.1229096 -0.0006748 -0.0138405 -0.0517062 -0.0604322 -0.1067978 0.0010586 -0.0569786 0.0284586 0.0283657 -0.0979182 0.0803124 -0.0487704 0.0065565 0.1075268 0.0171473 0.0827999 -0.0276749 0.0739442 -0.0043806 0.0077849 0.0399658 -0.0455531 -0.0419235 0.0188202 -0.0392155 0.1457852 -0.0207621 0.0727019 0.0334107 0.0367747 0.0545027 -0.0237811 0.0272829 -0.0289216 0.1501147 unknown
polarizability: 130.943985|17.8541763|92.7073036|-0.6610749|5.784304|49.1972406 unknown
InChI: InChI=1S/C8H8O2/c1-2-6-5-7(9)3-4-8(6)10/h3-5H,2H2,1H3
charge 0 multiplicity 1
18 atoms
O  -1.605414 -1.811233 0.003328
O  2.873378 1.293018 0.089901
C  -0.667417 0.40146 0.308249
C  -2.044922 0.978231 0.543479
C  -0.568684 -1.071829 0.011524
C  0.482822 1.151201 0.335058
C  -2.833452 1.167874 -0.783852
C  1.821382 0.573297 0.06567
C  0.773825 -1.653287 -0.26365
C  1.901792 -0.883986 -0.237409
H  -2.62049 0.291877 1.191255
H  -1.956588 1.949178 1.063857
H  0.461805 2.22494 0.556592
H  -3.826608 1.602654 -0.573543
H  -2.984879 0.19936 -1.289759
H  -2.298151 1.846508 -1.471635
H  0.795194 -2.727341 -0.479477
H  2.901507 -1.28752 -0.432888
