program: Gaussian 09
title: 000078492
version: EM64L-G09RevD.01
frameworkgroup: C1[X(C6H9NO)]
method: RPBEPBE
basis: SDD
operation: Freq
keyword: #pfreq=noraman
keyword: PBEPBE/SDD
title: #p freq=noraman PBEPBE/SDD
converged: YES YES NO NO
title: Mulliken charges:
elementType: O N C C C C C C H H H H H H H H H
charge: -0.216736 -0.295375 -0.458623 0.345710 -0.412549 -0.261659 -0.623301 -0.172657 0.195984 0.229180 0.263105 0.257970 0.250710 0.187462 0.226089 0.227897 0.256793
chargesum: 0.00000
title: Mulliken charges with hydrogens summed into heavy atoms:
elementType: O N C C C C C C
charge: -0.216736 -0.032269 -0.033459 0.345710 -0.154579 -0.010949 0.018147 0.084136
polarizability: 9.63111579e+01 2.63444083e-01 6.86979337e+01 5.60685105e+00 -8.59141295e-01 4.82613670e+01
1716.lowfreq: -5.8529 -0.0006 0.0000 0.0005 6.2885 11.1898 54.1827 82.6690 113.6970
frequency: 54.0424 82.6512 113.6933 225.0385 295.2021 308.8367 366.0303 594.7470 604.1619 648.3835 726.8635 737.6872 817.3035 868.1650 873.5977 876.8084 946.0921 951.2990 1013.7611 1048.3356 1102.6632 1128.7592 1134.7989 1151.5195 1195.4476 1222.7375 1254.0969 1351.6754 1363.6588 1432.8689 1445.3322 1463.9678 1470.3406 1488.0512 1493.5883 1590.0111 2853.7588 2863.4812 2997.8905 3009.5920 3077.7104 3215.6844 3231.2153 3266.5285 3470.2723
redmass: 3.0077 2.2147 3.4822 1.2270 2.9467 2.4707 4.5487 3.1404 1.9493 2.0397 1.3348 3.4492 1.3043 4.9306 1.3921 3.8572 1.8978 1.9435 1.5234 2.7987 1.3543 1.8797 1.5525 3.0358 1.9571 2.0357 1.4007 1.4208 2.4225 1.1453 1.1832 1.0818 1.0808 4.6383 1.0593 6.8622 1.0685 1.0602 1.0857 1.0749 1.0985 1.0925 1.0983 1.1083 1.0754
irintensity: 0.3699 2.9108 3.3392 1.8569 4.7113 5.2229 1.0673 19.3902 74.9817 52.6792 80.1876 12.9898 33.1082 11.3177 0.5082 9.6677 6.9977 9.6743 33.3216 0.4968 0.7875 12.6020 23.9693 27.5324 4.4441 5.0611 8.5168 14.1964 2.9731 2.5633 29.3597 6.7801 5.7286 9.5208 13.7167 3.8487 63.5066 204.6791 30.3919 44.3364 35.9063 5.1483 0.7446 0.8295 0.3194
temp: 298.150 k
press: 1.00000 atm
elementType: 8 7 6 6 6 6 6 6 1 1 1 1 1 1 1 1 1
symmnumber: 1
zpe: 367423.1 jmol-1
zpe.correction: 0.139944 hartree
zpe.thermalcorrener: 0.148037 hartree
zpe.thermalcorrenthalpy: 0.148981 hartree
zpe.thermalcorrgfe: 0.106607 hartree
zpe.sumelectzpe: -363.349628 hartree
zpe.sumelectthermal: -363.341536 hartree
zpe.sumelectthermalent: -363.340591 hartree
zpe.sumelectthermalfe: -363.382965 hartree
dipole: 0.1689 1.8240 -0.1539
dipole: 1.8383
quadrupole: -40.1085 -47.5217 -48.7607
quadrupole: 2.2853 1.4432 -1.1613
quadrupole: 5.3551 -2.0581 -3.2971 2.2853 1.4432 -1.1613
hfenergy: -363.4895723 hartree
pointgroup: C01 [X(C6H9N1O1)]
dipole: -0.0422153 0.6996847 0.1781391 debye
dipolederiv: -0.4315926 -0.1236267 -0.1278997 -0.0707737 -0.5206005 -0.1045853 -0.1219585 -0.128415 -0.1775547 -0.7826503 0.0612422 -0.0010447 0.0436109 -0.5648463 0.1974715 0.0189111 0.1622187 -0.2810606 0.462989 0.109415 -0.1295874 -0.0294627 0.4407556 -0.1236537 -0.2479703 -0.1382854 0.4030745 0.1665003 0.0139947 0.1081254 0.0113951 0.3471685 0.1309194 0.07695 0.1148786 -0.0231754 -0.109341 -0.0745658 0.0086354 -0.0723414 -0.0476913 0.0180405 0.0189176 0.0149048 -0.2163195 -0.0158266 -0.0137833 0.0592475 -0.0246797 -0.1114438 0.0074253 0.0486721 0.0210118 -0.2018358 0.5175768 -0.1193026 0.0734958 -0.0840375 0.3603831 -0.0172485 0.2152031 -0.0015639 0.1509643 0.1316193 0.1215247 0.1238181 0.1707984 0.1557694 0.112015 0.1139836 0.0982485 -0.091065 -0.0416353 0.0189685 0.011265 -0.0516838 -0.272342 0.1325043 0.0805258 0.0414956 0.0147445 -0.0148642 -0.0191265 -0.0606698 -0.0538702 0.0352263 -0.0933042 -0.0179309 -0.0411928 -0.1047761 0.1240305 -0.0612693 -0.0074881 -0.0860879 0.2342982 -0.177217 -0.0081027 -0.053918 0.0375845 0.1246401 0.0526809 -0.0105011 0.0488215 -0.0305272 -0.0406433 -0.0112607 -0.0366967 0.1835456 -0.0330491 -0.0319862 -0.064751 -0.0391653 0.1203034 -0.0297882 -0.0728374 -0.0265562 0.1805152 -0.1362986 0.0636421 -0.0156677 0.2366602 -0.2529606 0.0393551 -0.0844157 0.0421534 0.0623838 -0.0661284 -0.0455995 0.0810109 -0.0513762 0.0601506 0.0925947 0.1447014 0.0848006 -0.0393868 0.0399145 0.003602 -0.019862 -0.0106111 0.0184761 -0.1142486 -0.1284174 -0.1183982 -0.105313 0.0641155 0.0441897 -0.0281267 0.0628035 0.0278806 -0.0296371 -0.0249711 -0.0346858 0.2076745 unknown
polarizability: 96.2328024|-2.1319746|67.9759618|5.4774491|3.9537553|49.0616945 unknown
InChI: InChI=1S/C6H9NO/c1-7-5-6-3-2-4-8-6/h2-4,7H,5H2,1H3
charge 0 multiplicity 1
17 atoms
O  0.803682 -1.030874 -0.402663
N  -2.088625 -0.159005 0.44653
C  -1.197081 0.444573 -0.569035
C  0.252088 0.260665 -0.239205
C  1.243447 1.121287 0.211326
C  2.464223 0.350541 0.34346
C  -3.524539 -0.018543 0.154994
C  2.157687 -0.944459 -0.036885
H  -1.369129 1.542272 -0.70965
H  -1.422188 -0.03762 -1.541232
H  -1.835794 0.133771 1.398153
H  1.116903 2.182076 0.420866
H  3.435649 0.712636 0.674137
H  -3.872495 1.036955 0.022956
H  -4.112822 -0.473813 0.970815
H  -3.768519 -0.565469 -0.775443
H  2.724112 -1.868691 -0.108324
