program: Gaussian 09
title: 000078491
version: EM64L-G09RevD.01
frameworkgroup: C1[X(C6H11BrO2)]
method: RPBEPBE
basis: SDD
operation: Freq
keyword: #p
keyword: freq=noraman
keyword: PBEPBE/SDD
title: #p freq=noraman PBEPBE/SDD
converged: NO YES NO NO
title: Mulliken charges:
elementType: Br O O C C C C C C H H H H H H H H H H H
charge: -0.035702 -0.260198 -0.245627 -0.386499 -0.308907 -0.265109 -0.687778 0.287983 -0.750175 0.216374 0.216385 0.228283 0.228295 0.230274 0.230244 0.279536 0.279539 0.248109 0.247971 0.247000
chargesum: 0.00000
title: Mulliken charges with hydrogens summed into heavy atoms:
elementType: Br O O C C C C C C
charge: -0.035702 -0.260198 -0.245627 0.046260 0.147670 0.195410 -0.128702 0.287983 -0.007094
polarizability: 1.29805828e+02 -8.93550347e+00 7.58324614e+01 -2.80434687e-03 -1.23490889e-02 5.64776088e+01
1716.lowfreq: -43.8617 -0.0007 -0.0007 -0.0004 2.6942 5.6553 9.4082 31.7372 43.6760
frequency: -43.4530 31.3370 43.4959 59.0961 97.6916 118.8726 152.9921 186.1967 189.9261 316.9761 369.4769 457.7113 566.1647 601.0658 633.2136 747.4828 778.6122 829.7972 890.1883 940.0915 1001.7300 1029.7417 1036.6926 1041.8578 1050.9728 1097.3402 1154.4895 1203.6669 1219.4792 1233.2942 1277.8760 1280.4188 1288.0973 1339.6487 1371.9394 1384.5009 1452.1160 1453.2405 1454.7975 1470.3145 1474.5652 1487.7345 1653.4566 2993.7208 3000.7764 3007.4431 3009.3404 3040.5762 3052.2986 3060.2254 3081.8795 3096.6505 3137.3858 3145.9318
redmass: 1.0547 3.8049 3.2903 5.6485 2.4168 2.0731 5.8635 7.7763 2.8589 3.3526 4.6018 3.4730 2.9978 5.4702 4.6369 1.0679 1.1443 6.1880 1.2419 4.8644 2.2010 3.9217 1.1507 1.6578 4.0296 2.8689 1.3166 3.5141 1.1823 1.3110 1.1363 1.2584 1.0861 1.3846 1.4399 1.3056 1.1021 1.0627 1.0468 1.0745 1.0868 1.0929 9.3101 1.0599 1.0587 1.0563 1.0378 1.1018 1.0564 1.1054 1.1077 1.0973 1.1112 1.1008
irintensity: 0.6453 0.3362 0.0348 0.5983 0.3462 1.8698 4.2084 4.7179 7.4070 0.8461 22.5390 0.6958 2.7925 1.6814 32.8495 12.2178 0.2904 24.1564 0.7815 21.2137 105.4216 0.3937 1.3555 10.6933 58.1574 7.9736 0.5802 381.0347 10.0206 0.7581 1.5069 49.1491 0.2683 7.2324 14.0845 41.6157 4.1425 26.8189 18.4782 0.2940 0.9873 18.3806 198.0348 2.2438 4.1608 39.8912 8.4783 0.0000 23.3748 1.9179 61.2900 8.7887 17.4923 10.4614
temp: 298.150 k
press: 1.00000 atm
elementType: 35 8 8 6 6 6 6 6 6 1 1 1 1 1 1 1 1 1 1 1
symmnumber: 1
zpe: 425240.1 jmol-1
zpe.correction: 0.161965 hartree
zpe.thermalcorrener: 0.172757 hartree
zpe.thermalcorrenthalpy: 0.173701 hartree
zpe.thermalcorrgfe: 0.122140 hartree
zpe.sumelectzpe: -398.419786 hartree
zpe.sumelectthermal: -398.408994 hartree
zpe.sumelectthermalent: -398.408050 hartree
zpe.sumelectthermalfe: -398.459612 hartree
dipole: 1.5205 -2.6969 0.0018
dipole: 3.0960
quadrupole: -74.1195 -67.7928 -62.4975
quadrupole: -9.0638 0.0019 0.0063
quadrupole: -5.9829 0.3438 5.6391 -9.0638 0.0019 0.0063
hfenergy: -398.5817511 hartree
pointgroup: C01 [X(C6H11Br1O2)]
dipole: -0.5508184 -1.0863774 -0.004834 debye
dipolederiv: -0.6242352 -0.0708209 0.0011712 -0.1939642 -0.2066606 0.0003152 0.0005299 -0.0000637 -0.1503925 -1.8411265 0.141453 0.0072605 0.2389662 -0.5257637 -0.0025522 0.0062337 -0.0015609 -0.2830076 -0.7177256 -0.0415433 0.0014987 0.4053057 -0.9205855 -0.0042404 0.0048406 -0.0042274 -0.3087697 -0.1693388 0.0032418 0.0011948 0.2100191 0.0965056 -0.0009319 0.0021605 -0.0003151 0.1665138 -0.2015808 0.0153407 0.0012723 -0.1156587 -0.0040413 -0.0004744 0.0005048 -0.000904 0.1400038 0.8818893 0.0460903 -0.0016048 0.0932947 0.2280521 -0.0011995 -0.0016373 -0.0010427 0.3595465 0.8288466 0.2382268 -0.0009986 0.2541181 0.2419296 -0.000177 -0.0009776 -0.0001831 0.1288964 1.8528697 -0.0494214 -0.0075127 -0.6032488 1.2323887 0.0075931 -0.0107126 0.0061382 0.1915055 -0.2663898 -0.1645046 0.0002835 -0.2302092 -0.2262646 -0.0002232 0.0005994 -0.00029 0.0305173 0.0760309 0.001537 0.00696 0.0032273 -0.0119707 -0.102154 -0.0040167 -0.118414 -0.0631596 0.0759966 0.0022643 -0.0078276 0.00375 -0.0143534 0.1026198 0.0032954 0.1189073 -0.0606989 0.0698129 -0.001433 0.0085445 0.0165138 -0.0079038 -0.0980875 0.0005628 -0.1087689 -0.0541041 0.0697746 -0.0006193 -0.0093878 0.0171869 -0.0103349 0.0985054 -0.0011981 0.109265 -0.05158 -0.035863 -0.0025394 0.012099 -0.0595618 -0.0016799 -0.078071 -0.0081291 -0.0936468 -0.0609755 -0.0358691 -0.0017647 -0.0122967 -0.0590616 -0.0034454 0.0791908 0.0074352 0.0943576 -0.0592687 -0.0380109 -0.0809055 0.0301073 -0.0322624 -0.0241343 0.0887527 -0.0167074 0.0997746 -0.016243 -0.0381889 -0.0812853 -0.0308826 -0.033042 -0.0219886 -0.088628 0.0165067 -0.099273 -0.0182769 0.0936702 0.0033568 -0.0462462 0.0001972 0.0635009 0.0882005 -0.0053911 0.1059754 -0.0072812 0.0947904 0.0011692 0.0446732 -0.0015088 0.0661728 -0.0872002 0.0037353 -0.1049949 -0.0112255 -0.0753527 0.0421576 0.0016921 0.0859387 0.0505771 -0.0012382 0.0023656 -0.0007336 0.1279998 unknown
polarizability: 128.9121963|11.2807883|76.7248315|-0.1979248|0.0853061|56.4788701 unknown
InChI: InChI=1S/C6H11BrO2/c1-6(8)9-5-3-2-4-7/h2-5H2,1H3
charge 0 multiplicity 1
20 atoms
Br 5.132874 0.425873 -0.017685
O  -1.554199 -0.518495 -0.000665
O  -2.906567 1.379868 0.01676
C  0.869439 -0.549038 -0.009107
C  2.182131 0.278952 -0.008563
C  -0.354574 0.368933 -0.000326
C  3.401856 -0.644545 -0.017947
C  -2.796308 0.133714 0.007104
C  -3.922691 -0.875879 0.008787
H  0.827522 -1.200155 -0.90286
H  0.832962 -1.209827 0.877752
H  2.217431 0.930749 0.884539
H  2.211667 0.941353 -0.894023
H  -0.389741 1.012393 0.898087
H  -0.395919 1.021374 -0.891954
H  3.465828 -1.275322 0.88211
H  3.459739 -1.265146 -0.925455
H  -3.843656 -1.533278 0.891852
H  -3.85756 -1.520007 -0.885145
H  -4.889034 -0.352617 0.020142
