program: Gaussian 09
title: 000078486
version: EM64L-G09RevD.01
frameworkgroup: C1[X(C3H5NO2)]
method: RPBEPBE
basis: SDD
operation: Freq
keyword: #pfreq=noraman
keyword: PBEPBE/SDD
title: #p freq=noraman PBEPBE/SDD
converged: YES YES NO NO
title: Mulliken charges:
elementType: O O N C C C H H H H H
charge: -0.213536 -0.205652 0.048740 0.440732 -0.723505 -0.595803 0.259363 0.222002 0.259280 0.270045 0.238336
chargesum: 0.00000
title: Mulliken charges with hydrogens summed into heavy atoms:
elementType: O O N C C C
charge: -0.213536 -0.205652 0.048740 0.440732 0.017139 -0.087422
polarizability: 5.30480658e+01 -4.32021904e+00 6.61289550e+01 -6.50656511e-03 -4.35975372e-03 2.47055621e+01
1716.lowfreq: -5.5009 0.0007 0.0010 0.0011 3.1935 12.8516 67.7764 173.1867 301.7967
frequency: 67.6939 173.1832 301.7963 377.9645 388.4013 516.3138 557.2362 601.1414 779.6728 784.0120 915.2197 980.2480 1000.9120 1055.9355 1198.8690 1216.6827 1375.4138 1395.8786 1417.0128 1449.8486 1464.7450 1670.7587 3001.9438 3086.8549 3114.8615 3124.3017 3240.0021
redmass: 5.4861 1.0304 4.0660 3.6561 2.5790 5.1894 4.8548 1.7072 1.8597 9.9963 1.8678 1.3175 1.4472 1.4846 6.2168 3.5423 3.6541 1.4439 1.2865 1.0432 1.0568 5.8745 1.0365 1.0977 1.1005 1.0622 1.1160
irintensity: 0.0049 0.7119 1.8687 0.7360 3.0011 2.8867 2.9173 9.5666 4.0286 21.7199 6.2885 68.3621 10.9021 6.5150 93.5520 34.5208 162.9644 7.7398 14.0847 16.9936 30.2402 13.0746 6.3412 8.2623 10.5628 4.3146 0.5808
temp: 298.150 k
press: 1.00000 atm
elementType: 8 8 7 6 6 6 1 1 1 1 1
symmnumber: 1
zpe: 210883.1 jmol-1
zpe.correction: 0.080321 hartree
zpe.thermalcorrener: 0.086577 hartree
zpe.thermalcorrenthalpy: 0.087521 hartree
zpe.thermalcorrgfe: 0.050254 hartree
zpe.sumelectzpe: -321.943073 hartree
zpe.sumelectthermal: -321.936817 hartree
zpe.sumelectthermalent: -321.935873 hartree
zpe.sumelectthermalfe: -321.973140 hartree
dipole: -4.3264 0.8400 0.0006
dipole: 4.4072
quadrupole: -36.9318 -35.0049 -35.0811
quadrupole: -0.0633 -0.0011 0.0043
quadrupole: -1.2592 0.6677 0.5915 -0.0633 -0.0011 0.0043
hfenergy: -322.0233944 hartree
pointgroup: C01 [X(C3H5N1O2)]
dipole: -1.7243936 0.1811672 -0.0117712 debye
dipolederiv: -0.6816914 -0.2057905 -0.0420711 -0.1691702 -0.6212365 -0.0637018 -0.0363374 -0.0645473 -0.2429533 -0.4944529 0.2051672 0.0255259 -0.0031101 -0.7590626 -0.0809716 -0.006514 -0.07627 -0.2446607 1.1835879 -0.217596 -0.0109363 0.0423252 1.088331 0.1373131 0.0291526 0.1314899 0.2207963 -0.1083832 0.2932986 0.0425659 0.3907894 0.2549754 0.0461647 0.0574634 0.0433624 0.0234921 -0.0301147 -0.0506632 -0.0099142 -0.0992387 -0.1830385 -0.0410165 -0.0174477 -0.0391925 0.0605333 0.0074272 0.008194 0.0083479 -0.1813232 -0.1483305 0.0199627 -0.020814 0.0242477 -0.3007888 0.0981427 0.0001553 0.064819 -0.0074708 0.0685012 -0.0578887 0.0295453 -0.071888 -0.0295491 -0.1148239 0.0004792 -0.0061806 0.0752844 0.0779818 -0.0049949 0.0054677 -0.0070838 0.1228223 0.1024727 0.0141001 -0.0568435 -0.0026567 0.022099 0.0747108 -0.0254141 0.0893965 0.0113966 0.084546 -0.0646917 -0.013011 -0.0505066 0.0753403 -0.0228794 -0.0109339 -0.0230881 0.2116645 -0.0467104 0.017347 -0.002302 0.0050772 0.1244396 -0.0066984 -0.004168 -0.0064269 0.1672467 unknown
polarizability: 53.9052618|-5.4504293|64.3531337|-0.1701157|5.985616|25.6241874 unknown
InChI: InChI=1S/C3H5NO2/c1-3(2)4(5)6/h1H2,2H3
charge 0 multiplicity 1
11 atoms
O  1.530761 0.982274 0.188381
O  1.233359 -1.251699 -0.162056
N  0.783414 -0.053109 0.011941
C  -0.711589 0.112192 0.002549
C  -1.485211 -1.160277 -0.211972
C  -1.201616 1.361815 0.184588
H  -1.217125 -1.632258 -1.173088
H  -2.565382 -0.942642 -0.206834
H  -1.263107 -1.899266 0.577479
H  -0.529772 2.212412 0.331565
H  -2.281231 1.535256 0.186547
