program: Gaussian 09
title: 000078563
version: EM64L-G09RevD.01
frameworkgroup: C1[X(C18H16O4)]
method: RPBEPBE
basis: SDD
operation: Freq
keyword: #pfreq=noraman
keyword: PBEPBE/SDD
title: #p freq=noraman PBEPBE/SDD
converged: YES YES NO NO
title: Mulliken charges:
elementType: O O O O C C C C C C C C C C C C C C C C C C H H H H H H H H H H H H H H H H
charge: -0.266658 -0.180422 -0.186691 -0.197364 -0.449467 0.109981 0.109918 0.316530 0.340195 0.227626 -0.330502 -0.328430 -0.354118 -0.351427 -0.220273 -0.259986 -0.259935 -0.228171 -0.232766 -0.221016 -0.223798 -0.674016 0.266853 0.249951 0.235713 0.280079 0.277985 0.226786 0.241867 0.233037 0.231825 0.236704 0.234801 0.236105 0.234464 0.214021 0.236572 0.224026
chargesum: 0.00000
title: Mulliken charges with hydrogens summed into heavy atoms:
elementType: O O O O C C C C C C C C C C C C C C C C C C
charge: -0.266658 -0.180422 -0.186691 -0.197364 -0.182614 0.109981 0.109918 0.316530 0.340195 0.227626 -0.080550 -0.092717 -0.074040 -0.073442 0.248380 -0.026949 -0.028110 0.008533 0.002035 0.015089 0.010666 0.000604
polarizability: 2.48229434e+02 4.72753036e+00 2.09760254e+02 1.83306269e+01 9.81133954e+00 1.55693408e+02
1716.lowfreq: -12.5267 -8.6615 -5.0407 -0.0004 0.0003 0.0008 7.4988 18.8578 31.8210
frequency: 5.2821 18.7022 31.6155 37.4857 41.2861 49.5052 76.7984 95.6958 101.4126 142.2420 148.0628 152.9738 184.4813 191.8732 213.0858 254.3439 270.3784 321.6811 325.2889 378.3237 399.6464 399.9490 422.7620 424.9820 456.0227 476.6108 564.0468 583.1095 609.5278 612.3740 614.0345 676.6329 680.7894 694.4071 695.5675 735.1408 765.7329 786.0956 797.5716 809.2357 826.3828 856.2068 859.6407 887.3054 909.1770 945.9997 950.5437 988.3977 988.9063 990.7328 991.6132 994.2450 1004.2116 1010.1720 1012.4844 1025.4901 1028.4736 1030.6130 1088.4228 1088.5549 1098.8155 1114.6948 1135.7076 1174.1190 1174.7953 1190.3880 1191.7084 1200.3039 1231.7602 1249.1913 1260.4006 1272.2310 1320.6492 1323.7847 1356.5281 1388.2358 1388.9923 1399.8715 1435.6165 1436.5488 1463.1110 1473.3606 1479.4653 1479.9310 1485.5992 1570.9223 1573.6160 1596.8340 1599.6894 1611.5585 1613.8032 1652.6578 2996.3454 3013.9984 3027.3688 3073.9351 3092.9835 3109.0927 3128.8130 3128.9488 3136.5196 3136.5661 3148.3368 3148.5355 3159.2736 3160.0836 3170.5317 3170.7745
redmass: 3.6420 6.1559 5.2702 3.9791 3.7461 2.6647 5.6127 6.6280 8.3785 3.9618 3.9715 4.6925 3.8812 5.3517 4.2835 1.5867 5.3823 7.1044 7.8991 3.9112 2.8065 2.8082 4.0647 3.9550 6.3848 7.0315 8.3778 5.6571 5.4002 6.4044 6.3581 6.1730 6.5036 1.7733 1.9164 3.2367 2.0430 2.4334 1.1074 3.2084 6.3848 1.2551 1.2597 4.3404 6.3471 1.4545 1.5143 4.7236 2.8303 1.8741 2.2669 1.9433 3.5952 1.3680 1.3757 2.3238 2.0779 2.1033 1.6644 1.6124 3.1521 2.2577 1.4713 1.0783 1.0624 1.1307 1.2201 1.6347 2.6570 1.1559 2.7997 2.0936 1.3280 1.3271 1.3650 8.6964 9.0501 1.2629 2.2571 2.2679 1.0401 1.0627 2.1782 2.2136 1.0677 7.3795 7.2821 6.8530 6.9696 6.3762 6.8310 10.7485 1.0358 1.0585 1.0813 1.1062 1.0986 1.1029 1.0853 1.0856 1.0884 1.0884 1.0923 1.0925 1.0960 1.0960 1.1012 1.1010
irintensity: 0.7311 0.9525 2.3231 0.2671 0.1978 1.4695 0.1689 0.1746 1.1069 1.5264 0.5029 0.6475 4.3753 5.9690 0.6840 1.8963 0.8515 9.1734 4.1628 4.5028 0.1516 0.0950 0.4001 0.7823 0.3136 0.6620 35.2772 19.2178 15.6144 1.3561 2.8580 5.5835 10.6601 47.2112 42.6232 7.5541 46.7392 49.0217 3.0985 5.3046 20.4078 1.3987 0.8017 1.2714 51.8310 4.4532 6.6939 2.4541 4.9492 6.4406 33.5343 17.2888 66.9846 2.2187 1.7190 34.4852 5.9065 19.4408 36.3694 1.8464 287.0038 31.6398 8.1639 8.1858 0.8666 47.8207 14.9754 74.4442 67.7245 9.6563 232.6848 284.4230 10.0149 8.6338 2.7474 2.2317 2.1820 23.6116 18.8358 24.6733 12.1917 3.4352 1.0172 1.3640 13.9470 107.9201 96.8509 54.6468 61.7574 8.6731 16.7826 186.4347 20.9127 17.0006 3.2596 3.8148 30.0339 39.0696 4.1662 0.8489 7.3100 4.7272 21.3596 20.5539 13.5716 14.8348 29.5821 16.6527
temp: 298.150 k
press: 1.00000 atm
elementType: 8 8 8 8 6 6 6 6 6 6 6 6 6 6 6 6 6 6 6 6 6 6 1 1 1 1 1 1 1 1 1 1 1 1 1 1 1 1
symmnumber: 1
zpe: 768417.2 jmol-1
zpe.correction: 0.292675 hartree
zpe.thermalcorrener: 0.313291 hartree
zpe.thermalcorrenthalpy: 0.314235 hartree
zpe.thermalcorrgfe: 0.238097 hartree
zpe.sumelectzpe: -994.842429 hartree
zpe.sumelectthermal: -994.821813 hartree
zpe.sumelectthermalent: -994.820869 hartree
zpe.sumelectthermalfe: -994.897007 hartree
dipole: -1.3894 -1.4166 -5.6917
dipole: 6.0276
quadrupole: -104.2104 -111.3592 -135.4533
quadrupole: -1.9032 3.4319 -1.6897
quadrupole: 12.7972 5.6484 -18.4456 -1.9032 3.4319 -1.6897
hfenergy: -995.1351039 hartree
pointgroup: C01 [X(C18H16O4)]
dipole: -0.4562959 -0.6952557 -2.2208482 debye
polarizability: 245.5533337|11.734685|213.2471107|15.1883501|11.6343792|154.8826506 unknown
InChI: InChI=1S/C18H16O4/c1-2-22-18(21)15(16(19)13-9-5-3-6-10-13)17(20)14-11-7-4-8-12-14/h3-12,15H,2H2,1H3
charge 0 multiplicity 1
38 atoms
O  -1.411016 2.454715 -0.530388
O  0.307333 -1.2056 1.762361
O  1.338365 2.141646 1.183241
O  -1.864066 1.561353 1.57848
C  -0.148666 0.52868 0.105841
C  -0.40845 -0.838077 0.792165
C  1.248366 1.101804 0.476991
C  -1.52661 -1.689992 0.2708
C  2.462581 0.406275 -0.057834
C  -1.233532 1.536979 0.504222
C  -2.355819 -1.299927 -0.816385
C  2.395282 -0.696429 -0.950936
C  -1.756327 -2.942856 0.903324
C  3.735793 0.895166 0.343678
C  -2.33667 3.596112 -0.233527
C  -3.390751 -2.14916 -1.261259
C  3.577224 -1.294749 -1.434793
C  -2.78887 -3.789355 0.457723
C  4.915314 0.295614 -0.136702
C  -3.608698 -3.394923 -0.627936
C  4.839223 -0.801066 -1.029587
C  -2.33931 4.493382 -1.465869
H  -0.190791 0.413702 -0.992874
H  -2.21256 -0.334196 -1.313926
H  1.428947 -1.100347 -1.272045
H  -1.111699 -3.221957 1.743276
H  3.767817 1.743889 1.034534
H  -3.334677 3.180813 -0.003819
H  -1.958009 4.109708 0.667821
H  -4.027891 -1.841331 -2.097232
H  3.516855 -2.145021 -2.122483
H  -2.959537 -4.75176 0.951891
H  5.891645 0.676538 0.18164
H  -4.413221 -4.052535 -0.975606
H  5.756388 -1.268711 -1.404782
H  -3.002855 5.360263 -1.293259
H  -1.324621 4.870008 -1.679006
H  -2.704287 3.949045 -2.353842
