program: Gaussian 09
title: 000078485
version: EM64L-G09RevD.01
frameworkgroup: C1[X(C4H11N)]
method: RPBEPBE
basis: SDD
operation: Freq
keyword: #pfreq=noraman
keyword: PBEPBE/SDD
title: #p freq=noraman PBEPBE/SDD
converged: YES YES NO NO
title: Mulliken charges:
elementType: N C C C C H H H H H H H H H H H
charge: -0.312381 -0.014938 -0.675760 -0.706701 -0.635307 0.173601 0.200918 0.223822 0.216263 0.203402 0.210990 0.226905 0.255367 0.228991 0.187083 0.217744
chargesum: 0.00000
title: Mulliken charges with hydrogens summed into heavy atoms:
elementType: N C C C C
charge: -0.057013 0.158663 -0.034757 -0.065403 -0.001490
polarizability: 5.81203968e+01 7.75119380e-02 5.20346751e+01 4.46352089e-01 6.46491193e-01 4.49704980e+01
1716.lowfreq: -23.7056 -0.0008 -0.0003 0.0005 11.7953 15.7905 100.4131 194.1309 210.1056
frequency: 100.3568 194.1297 210.0503 254.0491 269.7470 357.1801 431.5312 469.2639 635.0953 795.8138 917.2070 928.5307 951.2601 1068.7971 1084.4571 1100.1189 1158.9353 1183.3904 1212.8019 1323.1905 1335.2294 1371.9397 1387.1320 1436.5766 1446.9196 1458.0273 1466.6898 1474.9379 1477.6034 1491.6609 1496.9132 2825.6360 2864.8121 2972.7630 2981.3728 3020.7368 3064.7039 3074.2170 3078.3412 3084.6066 3090.5399 3444.5743
redmass: 1.8312 1.0433 1.1649 1.1634 2.1489 2.1331 2.1443 2.3649 1.5116 2.1531 1.1748 1.8586 1.4229 1.5050 2.3994 1.3364 2.2368 2.0563 1.9582 1.4421 1.3292 1.2320 1.2266 1.1605 1.1568 1.0566 1.0551 1.0586 1.0984 1.0574 1.0500 1.0815 1.0570 1.0365 1.0353 1.0733 1.0979 1.0996 1.0991 1.1003 1.0996 1.0746
irintensity: 2.7263 0.5749 1.1583 0.8063 2.1063 0.2365 25.1147 1.0950 104.6931 4.8531 3.4777 0.6164 0.8505 8.3271 10.6589 1.0350 16.8724 18.8162 11.7942 3.5704 35.3473 22.8558 24.7003 4.7230 18.1135 7.1542 2.3821 3.9855 4.5634 14.1506 15.0454 102.4751 149.3286 38.0595 19.6241 49.5804 35.6696 57.7992 23.6893 13.5869 70.6043 2.6503
temp: 298.150 k
press: 1.00000 atm
elementType: 7 6 6 6 6 1 1 1 1 1 1 1 1 1 1 1
symmnumber: 1
zpe: 382756.2 jmol-1
zpe.correction: 0.145784 hartree
zpe.thermalcorrener: 0.152866 hartree
zpe.thermalcorrenthalpy: 0.153810 hartree
zpe.thermalcorrgfe: 0.115823 hartree
zpe.sumelectzpe: -213.314697 hartree
zpe.sumelectthermal: -213.307615 hartree
zpe.sumelectthermalent: -213.306671 hartree
zpe.sumelectthermalfe: -213.344658 hartree
dipole: -0.1062 -0.4563 1.0120
dipole: 1.1151
quadrupole: -32.0593 -31.8886 -35.6761
quadrupole: 0.5288 -0.3456 -0.3029
quadrupole: 1.1487 1.3194 -2.4681 0.5288 -0.3456 -0.3029
hfenergy: -213.4604811 hartree
pointgroup: C01 [X(C4H11N1)]
dipole: 0.0218667 -0.1639606 -0.4063569 debye
dipolederiv: -0.693384 0.0251849 0.0289841 0.0276108 -0.2753819 0.0844646 -0.0080442 0.174358 -0.6283135 0.4578286 -0.1406375 0.107399 -0.2272055 0.3323257 -0.0465522 0.0859631 -0.032583 0.4650508 0.0193728 -0.0005527 0.0116103 0.0421019 -0.1356497 -0.0538115 -0.0068196 -0.0540274 0.0446772 -0.1076987 -0.0441234 0.024091 -0.0655217 0.0203441 0.0151584 -0.0016586 0.0274462 0.0713694 0.3713533 0.0704087 -0.1252163 0.1865177 0.1753256 -0.0199362 -0.1089383 -0.0114316 0.3886071 -0.0528555 0.0057499 0.0471484 0.0423122 -0.0204413 0.0122956 -0.0636049 0.0334439 -0.330849 -0.1032035 0.1316972 -0.0801549 0.0906524 0.0295697 0.0217471 -0.0969465 0.0469616 0.0485892 0.1012498 -0.0010074 0.0157089 -0.0104077 0.0761826 0.0311542 0.0344753 -0.0405877 -0.1523647 -0.0725388 -0.161613 0.0514789 -0.1256603 -0.0117674 0.0192725 0.0574534 0.0242635 0.0660023 0.0752778 0.0347707 0.0216392 -0.020882 -0.1899529 -0.0849016 0.0143641 -0.0921379 0.0579783 -0.1096365 0.062286 -0.0669586 0.1090934 0.0447339 0.057765 -0.094392 0.0443769 0.054946 0.0942185 -0.0110225 -0.0020672 -0.0145747 0.0863914 -0.010717 0.0699983 0.0287724 -0.1520881 0.0908823 -0.0109732 -0.0115561 -0.0038812 -0.0514943 -0.0305255 -0.0207059 -0.1602403 0.2733112 0.0752172 -0.0294514 0.0117692 -0.113855 -0.1426221 -0.0792017 0.0166502 -0.0881871 0.032805 -0.0438619 -0.0187663 0.0158405 -0.0688185 0.0587565 0.0250195 0.1839972 0.0255545 -0.3002722 -0.1022215 0.0880499 -0.0497165 0.1525182 0.0036801 0.0587689 -0.0617916 0.0740179 0.060551 unknown
polarizability: 58.1186567|-0.3344067|52.0924069|-0.0186648|-0.3504753|44.9145064 unknown
InChI: InChI=1S/C4H11N/c1-4(2)5-3/h4-5H,1-3H3
charge 0 multiplicity 1
16 atoms
N  0.724619 -0.607989 0.262619
C  -0.457504 0.064186 -0.336389
C  -0.580284 1.513984 0.181781
C  -1.718769 -0.751596 0.014054
C  2.042236 -0.108333 -0.174925
H  -0.367683 0.108004 -1.454599
H  -1.48148 1.998189 -0.237623
H  -0.655628 1.509969 1.284168
H  0.293324 2.127778 -0.102508
H  -1.649025 -1.787636 -0.371477
H  -2.620057 -0.287919 -0.424889
H  -1.844916 -0.798981 1.111052
H  0.654546 -1.628642 0.154046
H  2.220495 0.906655 0.223149
H  2.166767 -0.060408 -1.28594
H  2.83516 -0.761261 0.231579
