program: Gaussian 09
title: 000078503
version: EM64L-G09RevD.01
frameworkgroup: C1[X(C13H10N2O3)]
method: RPBEPBE
basis: SDD
operation: Freq
keyword: #p
keyword: freq=noraman
keyword: PBEPBE/SDD
title: #p freq=noraman PBEPBE/SDD
converged: YES YES NO NO
title: Mulliken charges:
elementType: O O O N N C C C C C C C C C C C C C H H H H H H H H H H
charge: -0.259908 -0.201749 -0.211111 -0.483320 0.017968 0.544990 0.251463 -0.599176 0.427101 0.144069 -0.355059 -0.389308 -0.170534 -0.336906 -0.348875 -0.220955 -0.236554 -0.222784 0.280548 0.321074 0.321067 0.287819 0.240846 0.275590 0.214104 0.237148 0.234950 0.237502
chargesum: 0.00000
title: Mulliken charges with hydrogens summed into heavy atoms:
elementType: O O O N N C C C C C C C C C C C C C
charge: -0.259908 -0.201749 -0.211111 -0.162246 0.017968 0.544990 0.251463 -0.318628 0.427101 0.144069 -0.033991 -0.101489 0.070312 -0.061316 -0.134771 0.016193 -0.001604 0.014718
polarizability: 2.88180368e+02 6.34293612e+00 1.80225224e+02 6.55890551e+00 -4.35964765e+00 6.72288919e+01
1716.lowfreq: -3.5565 -0.0004 -0.0003 0.0003 5.6120 6.5290 24.9863 39.2536 57.0260
frequency: 24.9191 39.2345 57.0252 66.7256 81.7381 154.5725 168.9483 182.0616 213.2032 261.6144 289.7120 330.6907 399.9077 401.8612 417.4661 430.3101 475.9910 515.2186 537.4843 578.7338 614.0773 643.5409 650.3368 683.5564 685.4281 687.7087 701.9443 711.1290 763.0916 792.5976 820.9096 851.8650 863.7522 899.3203 915.5546 935.9835 952.7861 984.1214 985.3198 989.2801 1008.3798 1010.8007 1025.4826 1081.6593 1084.8152 1090.5558 1097.8122 1175.6638 1175.7986 1193.1935 1215.8232 1245.9284 1255.4155 1302.9890 1320.5549 1369.9696 1382.9240 1386.0625 1430.3798 1437.5629 1476.9810 1484.9410 1511.1549 1575.9635 1592.1307 1610.1163 1612.8303 1623.4940 3113.4294 3135.5695 3148.3697 3152.4145 3155.1413 3160.7731 3172.4085 3191.1248 3198.2015 3533.6323
redmass: 4.2110 7.2275 8.1762 7.1256 6.7430 5.7212 5.8575 5.3994 7.3209 4.4649 5.7909 8.2377 3.2627 6.1014 4.2801 3.6794 5.0534 7.2017 4.1206 6.4939 6.2862 1.5026 4.2459 3.7821 4.0888 3.6219 1.7739 3.6144 9.4150 2.4396 1.3812 1.3714 4.4403 5.5336 1.6290 1.4522 1.3642 5.9716 1.4882 4.7718 1.3472 1.3370 2.4045 1.9769 1.7369 1.5750 2.4469 1.1177 1.0919 1.1214 6.8443 3.2479 1.9217 1.6057 1.3793 5.8933 6.9078 8.8474 3.2245 2.6594 2.2277 2.8620 2.2753 6.5587 5.6626 6.0808 4.5956 7.3628 1.0884 1.0868 1.0915 1.0920 1.0899 1.0957 1.1009 1.0937 1.0967 1.0761
irintensity: 0.9230 0.6354 4.6802 0.4922 5.4929 4.1095 1.3660 1.9268 2.4924 1.5793 5.7906 1.6750 1.1573 1.2472 2.0342 0.9005 2.5195 2.0231 17.7688 23.3606 1.2812 26.0454 15.7472 17.6348 7.1904 2.5871 46.6607 108.6347 17.7425 22.8631 38.1279 0.8541 9.0104 10.4425 47.6940 3.2743 0.1572 0.7454 2.2839 1.3173 1.6595 4.4843 11.8868 25.7026 28.1596 19.2856 6.7853 4.8987 10.2422 21.2891 297.8912 107.6823 69.6557 105.2047 18.3316 206.1024 75.8765 5.2414 9.3701 25.2942 1.9421 160.7286 496.1136 52.6040 22.0021 13.0230 66.0625 63.4996 15.5716 0.8405 16.7303 6.6593 11.0225 13.1403 21.8982 8.5523 6.1435 13.6168
temp: 298.150 k
press: 1.00000 atm
elementType: 8 8 8 7 7 6 6 6 6 6 6 6 6 6 6 6 6 6 1 1 1 1 1 1 1 1 1 1
symmnumber: 1
zpe: 541311.2 jmol-1
zpe.correction: 0.206175 hartree
zpe.thermalcorrener: 0.220901 hartree
zpe.thermalcorrenthalpy: 0.221846 hartree
zpe.thermalcorrgfe: 0.162162 hartree
zpe.sumelectzpe: -835.242207 hartree
zpe.sumelectthermal: -835.227480 hartree
zpe.sumelectthermalent: -835.226536 hartree
zpe.sumelectthermalfe: -835.286220 hartree
dipole: -5.0389 -0.1230 0.0617
dipole: 5.0408
quadrupole: -109.3325 -103.7077 -106.6190
quadrupole: 22.7172 3.3199 -2.7064
quadrupole: -2.7794 2.8453 -0.0659 22.7172 3.3199 -2.7064
hfenergy: -835.4483815 hartree
pointgroup: C01 [X(C13H10N2O3)]
dipole: -1.9824902 -0.0503979 0.0156331 debye
polarizability: 288.0931123|6.6957102|179.9334916|7.5031586|-7.29756|67.6078794 unknown
InChI: InChI=1S/C13H10N2O3/c16-13(10-5-2-1-3-6-10)14-11-7-4-8-12(9-11)15(17)18/h1-9,14H
charge 0 multiplicity 1
28 atoms
O  -1.506448 2.110737 0.011199
O  5.596178 -0.87843 -0.035139
O  3.95007 -2.451969 -0.143293
N  -0.376663 0.053798 -0.026205
N  4.354576 -1.226972 -0.065336
C  0.976488 0.477116 0.01218
C  -2.832924 0.077288 0.003745
C  1.97199 -0.53082 -0.04319
C  3.327343 -0.155044 -0.006679
C  -1.535337 0.8422 0.004207
C  1.367028 1.844859 0.102241
C  3.742039 1.190729 0.084241
C  2.737806 2.178793 0.13816
C  -3.991962 0.776608 -0.42168
C  -2.9549 -1.272929 0.42967
C  -5.245324 0.132747 -0.447591
C  -4.211891 -1.915332 0.407179
C  -5.358247 -1.217306 -0.038231
H  1.721203 -1.594634 -0.112977
H  -0.517542 -0.953437 -0.128687
H  0.594531 2.614744 0.136563
H  4.806992 1.432319 0.109527
H  3.023091 3.233355 0.207867
H  -3.882865 1.8240 -0.720789
H  -2.093056 -1.824806 0.826153
H  -6.132514 0.679764 -0.783828
H  -4.298926 -2.952876 0.746868
H  -6.332237 -1.718303 -0.055975
