program: Gaussian 09
title: 000078490
version: EM64L-G09RevD.01
frameworkgroup: C1[X(C8H4Cl2N2)]
method: RPBEPBE
basis: SDD
operation: Freq
keyword: #p
keyword: freq=noraman
keyword: PBEPBE/SDD
title: #p freq=noraman PBEPBE/SDD
converged: NO NO NO NO
title: Mulliken charges:
elementType: Cl Cl N N C C C C C C C C H H H H
charge: 0.004828 0.004826 0.004263 0.004263 0.401622 0.401608 -0.329762 -0.329760 -0.380066 -0.380061 -0.211393 -0.211394 0.265479 0.265479 0.245035 0.245034
chargesum: 0.00000
title: Mulliken charges with hydrogens summed into heavy atoms:
elementType: Cl Cl N N C C C C C C C C
charge: 0.004828 0.004826 0.004263 0.004263 0.401622 0.401608 -0.064283 -0.064281 -0.380066 -0.380061 0.033642 0.033640
polarizability: 1.63582659e+02 -2.40627256e-04 1.45313323e+02 9.64072296e-03 1.57794842e-03 4.35352804e+01
1716.lowfreq: -13.4909 -0.0024 -0.0018 0.0007 2.4446 5.6069 80.8917 107.3379 179.0698
frequency: 80.8912 107.3379 179.0698 201.6863 206.1069 312.9604 337.1352 404.8641 422.4061 438.6965 479.8848 510.0008 535.8085 586.7404 633.4077 669.4768 760.5163 764.4948 785.8079 894.6161 906.8947 958.3590 962.1328 981.8041 1010.3312 1028.5620 1138.8330 1179.5474 1231.4284 1258.8415 1267.4721 1321.4769 1387.6905 1398.7902 1462.2949 1496.2040 1555.3240 1617.4365 3143.8652 3156.4325 3170.0222 3179.0036
redmass: 19.4140 4.3430 5.8847 8.0496 16.7935 31.2059 11.6403 3.5156 9.2580 4.9701 9.2131 8.7625 11.4562 4.7825 4.9141 6.8072 7.6141 4.9835 1.3369 1.4369 7.7426 12.7317 8.2475 1.3642 1.3419 2.2360 1.5949 1.0912 7.4751 1.6179 4.5346 5.4404 2.3086 9.8512 2.8700 5.3644 6.6572 6.4448 1.0867 1.0897 1.0954 1.1005
irintensity: 0.5081 0.0000 0.3567 0.7452 0.4082 0.0042 0.0000 0.3081 7.7059 0.0000 9.8954 0.7902 51.8156 17.7323 0.0000 7.7466 0.7150 0.0000 85.7235 0.0000 6.8254 1.0881 68.7227 2.1957 0.0000 4.0928 3.3954 3.5522 309.7571 3.8494 9.1570 27.0700 4.8302 22.6675 7.0938 35.3903 5.6535 2.4557 3.7988 4.3808 1.5774 13.6633
temp: 298.150 k
press: 1.00000 atm
elementType: 17 17 7 7 6 6 6 6 6 6 6 6 1 1 1 1
symmnumber: 1
zpe: 263924.0 jmol-1
zpe.correction: 0.100523 hartree
zpe.thermalcorrener: 0.109976 hartree
zpe.thermalcorrenthalpy: 0.110921 hartree
zpe.thermalcorrgfe: 0.064713 hartree
zpe.sumelectzpe: -1336.013229 hartree
zpe.sumelectthermal: -1336.003776 hartree
zpe.sumelectthermalent: -1336.002831 hartree
zpe.sumelectthermalfe: -1336.049039 hartree
dipole: -0.0001 6.7787 0.0002
dipole: 6.7787
quadrupole: -81.2647 -82.4412 -83.8090
quadrupole: 0.0000 0.0000 -0.0001
quadrupole: 1.2402 0.0638 -1.3040 0.0000 0.0000 -0.0001
hfenergy: -1336.1137521 hartree
pointgroup: C01 [X(C8H4Cl2N2)]
dipole: -2.6669357 -0.0011506 -0.0000655 debye
dipolederiv: -0.0970994 -0.0057259 -0.0000021 0.1280342 -0.913164 -0.000042 0.0000031 0.0000203 -0.0559728 -0.0969939 0.0064387 -0.0000013 -0.1273198 -0.913267 -0.0000895 -0.0000178 -0.0000921 -0.0559748 -0.2212757 -0.5540529 -0.0000147 0.1657046 -0.367497 0.0000122 0.0000097 -0.0000136 -0.1771266 -0.2216324 0.5541896 0.0000597 -0.1655773 -0.3671871 -0.0000161 -0.0000087 -0.0000043 -0.1771266 -0.0040543 0.0291024 -0.0000051 0.3198836 -0.3171378 -0.0000238 0.0000198 -0.0000205 0.097878 -0.0037612 -0.0288276 -0.0000083 -0.3196147 -0.3174372 -0.0000442 -0.000011 -0.0000518 0.0978764 -0.1824338 -0.0635428 -0.0000099 0.0330443 0.0538147 0.0000212 0.0000022 0.0000276 -0.1306501 -0.1824644 0.0633421 0.0000042 -0.0332413 0.053834 0.000016 -0.0000009 0.0000151 -0.1306494 0.3167445 0.1977482 -0.0000079 -0.3467412 1.4728494 0.0000395 -0.0000339 0.0000019 0.068253 0.3166231 -0.1987693 -0.0000119 0.3457291 1.4729785 0.0001518 0.0000395 0.0001477 0.0682556 0.1307076 0.1559777 0.0000101 0.0950028 0.0211089 0.0000081 0.0000074 0.000006 -0.1216712 0.1309236 -0.1558855 -0.0000108 -0.094914 0.0208972 0.0000073 -0.0000097 0.0000126 -0.1216714 0.1067489 0.0252689 0.0000038 -0.0233459 -0.0016559 -0.0000151 0.0000046 -0.0000163 0.1607705 0.1067545 -0.0251778 -0.0000035 0.0234392 -0.0016525 -0.0000116 -0.0000052 -0.0000183 0.1607701 -0.0493275 -0.0758164 -0.0000072 -0.0790139 0.0516929 -0.0000069 -0.0000096 -0.0000066 0.1585196 -0.0494594 0.0757306 0.0000049 0.0789303 0.0518228 -0.0000068 0.0000105 -0.0000078 0.1585196 unknown
polarizability: 145.313327|-0.0082781|163.5826548|0.0015737|0.0096414|43.5352804 unknown
InChI: InChI=1S/C8H4Cl2N2/c9-7-5-3-1-2-4-6(5)8(10)12-11-7/h1-4H
charge 0 multiplicity 1
16 atoms
Cl 1.16634 -3.156121 -0.000189
Cl 1.163602 3.15713 0.000336
N  2.227245 -0.703973 -0.000083
N  2.226635 0.705892 0.00011
C  -0.249441 -0.723902 -0.000116
C  -0.250056 0.723679 0.000023
C  -1.48984 -1.427515 -0.000149
C  -1.49105 1.426245 0.000052
C  1.055566 -1.337659 -0.000202
C  1.054417 1.338568 0.000132
C  -2.693999 -0.715368 -0.000099
C  -2.694604 0.713078 -0.000007
H  -1.477767 -2.521386 -0.000244
H  -1.479894 2.520124 0.000141
H  -3.647198 -1.254166 -0.000142
H  -3.648256 1.251074 0.000036
