program: Gaussian 09
title: 000078487
version: EM64L-G09RevD.01
frameworkgroup: C1[X(C5H5N3O3)]
method: RPBEPBE
basis: SDD
operation: Freq
keyword: #pfreq=noraman
keyword: PBEPBE/SDD
title: #p freq=noraman PBEPBE/SDD
converged: YES YES YES YES
title: Mulliken charges:
elementType: O O O N N N C C C C C H H H H H
charge: -0.186272 -0.210985 -0.138609 -0.178657 -0.028271 0.046981 0.329607 0.180688 -0.600526 -0.327112 -0.117494 0.275139 0.275145 0.217621 0.297681 0.165066
chargesum: 0.00000
title: Mulliken charges with hydrogens summed into heavy atoms:
elementType: O O O N N N C C C C C
charge: -0.186272 -0.210985 -0.138609 -0.178657 -0.028271 0.046981 0.329607 0.180688 0.167378 -0.029431 0.047572
polarizability: 1.47628086e+02 -1.45903546e-01 9.44624358e+01 -6.39584882e-03 5.70988918e-03 3.79493571e+01
1716.lowfreq: -5.0029 0.0003 0.0006 0.0007 0.8782 4.0609 46.0197 74.8521 104.7206
frequency: 46.0123 74.8494 104.7195 129.2360 171.0108 240.1497 259.0761 288.1990 346.5361 361.0611 455.8552 593.2495 597.2160 656.5457 678.0303 697.6227 752.1911 792.8525 879.2322 911.4818 950.7454 1098.8007 1108.8372 1118.7544 1187.8967 1207.9292 1285.5471 1310.6907 1345.7795 1378.6796 1400.6333 1423.3622 1445.8300 1461.2926 1467.7552 1485.3184 1611.4314 2903.4020 3033.1732 3129.0988 3149.8113 3251.2395
redmass: 4.4555 9.5069 1.7057 1.4578 9.9699 8.1583 7.3578 3.2346 3.6370 10.0340 9.1259 5.1294 6.1629 5.1852 7.3808 7.2891 12.6617 5.8949 1.4110 3.9601 1.8495 1.9356 4.0765 1.3296 2.5717 4.7769 3.6455 6.1211 12.0368 2.4651 4.3670 1.8331 2.8704 1.0389 1.7606 1.1558 7.8864 1.0832 1.0337 1.1024 1.1023 1.0997
irintensity: 2.1177 5.9950 5.8820 0.0413 11.1512 1.0003 0.3692 12.9854 4.4305 2.5312 2.2777 0.0018 1.3236 7.9299 2.3896 9.5534 30.4609 67.4093 22.6080 5.8066 3.0216 8.1903 8.3856 0.6660 176.6802 70.2537 82.6496 78.3730 152.5865 20.9531 77.0072 5.2658 103.4197 16.7158 5.0195 2.9534 187.0764 99.0611 12.1383 4.4929 9.4121 3.8844
temp: 298.150 k
press: 1.00000 atm
elementType: 8 8 8 7 7 7 6 6 6 6 6 1 1 1 1 1
symmnumber: 1
zpe: 279873.1 jmol-1
zpe.correction: 0.106598 hartree
zpe.thermalcorrener: 0.116660 hartree
zpe.thermalcorrenthalpy: 0.117605 hartree
zpe.thermalcorrgfe: 0.070012 hartree
zpe.sumelectzpe: -582.529309 hartree
zpe.sumelectthermal: -582.519246 hartree
zpe.sumelectthermalent: -582.518302 hartree
zpe.sumelectthermalfe: -582.565894 hartree
dipole: 0.1128 3.9080 0.0016
dipole: 3.9096
quadrupole: -91.4451 -58.9122 -60.8825
quadrupole: -9.6443 -0.0022 0.0011
quadrupole: -21.0318 11.5011 9.5308 -9.6443 -0.0022 0.0011
hfenergy: -582.6359067 hartree
pointgroup: C01 [X(C5H5N3O3)]
dipole: 0.0857029 -1.5357654 -0.0006149 debye
dipolederiv: -0.8026428 -0.1995197 -0.0000454 -0.297372 -0.5933853 -0.0000024 -0.0000956 -0.0000396 -0.2205273 -0.6309374 0.1242996 -0.0000424 0.2625034 -0.7598208 0.0000261 -0.0000595 0.0000598 -0.2265903 -1.1075112 -0.0158411 -0.0001015 0.2134388 -0.3659207 0.0000115 0.0003035 -0.0001055 -0.283825 0.460018 0.124738 0.0000371 0.225698 -0.6209436 -0.0000139 -0.0001622 -0.0000929 -0.0481461 -0.2990604 -0.0705406 -0.0000354 -0.0916841 -0.3531385 -0.0000193 -0.0000956 -0.0000211 -0.2260229 1.9729237 -0.0277983 0.0001817 -0.1285754 1.1630301 -0.0000485 0.0002332 -0.0000381 0.2188643 -1.0438739 0.2164394 -0.0001074 -0.0014975 0.0904364 0.0000389 -0.0001073 0.0000372 0.0821749 -0.7346543 -0.2970102 -0.0000369 -0.2913992 0.2098466 -0.0000514 -0.0000885 -0.0000559 0.0557095 0.1323666 0.0436285 -0.0000099 -0.0204944 0.3340357 0.0000005 -0.0000472 0.0000522 0.1772879 0.1736319 -0.0146889 0.0000378 -0.0287887 0.1618124 0.0000113 0.0000559 0.0000254 -0.0637193 1.6384554 0.1151487 0.0000989 0.2762937 0.7313291 0.0002245 0.0000009 0.0002124 0.124602 0.076454 0.0500859 0.072636 -0.0015768 0.045901 0.0085162 0.051661 -0.0233567 -0.0007369 0.0764779 0.0500875 -0.072613 -0.0015804 0.0459032 -0.0085294 -0.0516277 0.0233569 -0.0007655 -0.0554714 -0.1406107 -0.0000203 -0.0126704 0.0703724 -0.0000005 -0.0000073 -0.0000351 0.1232096 0.0875847 -0.026938 -0.0000098 -0.0382669 0.1034348 -0.0000115 -0.0000151 -0.0000064 0.1802825 0.0562392 0.0685198 0.0000304 -0.0640282 -0.2628929 -0.0001524 0.0000514 0.0000074 0.1082024 unknown
polarizability: 147.5817867|1.5750102|94.5087347|0.00624|0.0058798|37.9493571 unknown
InChI: InChI=1S/C5H5N3O3/c1-7-4(3-9)6-2-5(7)8(10)11/h2-3H,1H3
charge 0 multiplicity 1
16 atoms
O  3.052783 1.090541 0.000272
O  2.673346 -1.171242 0.000266
O  -3.775207 0.09894 0.000224
N  -0.152184 -0.640642 -0.000209
N  -1.142753 1.429992 -0.000132
N  2.268237 0.063768 0.000135
C  0.854585 0.330885 -0.000015
C  -1.362723 0.075537 -0.000321
C  0.025552 -2.111725 -0.000162
C  0.219661 1.592397 0.000011
C  -2.701474 -0.55104 -0.00069
H  0.590927 -2.426231 -0.890033
H  0.590677 -2.426196 0.889882
H  -0.961876 -2.593048 -0.000275
H  0.698673 2.567937 0.000141
H  -2.710425 -1.666972 -0.000795
