program: Gaussian 09
title: 000000105
version: EM64L-G09RevD.01
frameworkgroup: C1[X(C3H5O7P)]
method: RPBEPBE
basis: SDD
operation: Freq
keyword: #pfreq=noraman
keyword: PBEPBE/SDD
title: #p freq=noraman PBEPBE/SDD
converged: YES YES NO NO
title: Mulliken charges:
elementType: P O O O O O O O C C C H H H H H
charge: 1.399105 -0.500901 -0.677944 -0.677190 -0.587119 -0.098463 -0.366478 -0.206449 -0.304550 0.123747 0.127422 0.280739 0.281034 0.407848 0.407563 0.391637
chargesum: 0.00000
title: Mulliken charges with hydrogens summed into heavy atoms:
elementType: P O O O O O O O C C C
charge: 1.399105 -0.500901 -0.270096 -0.269627 -0.587119 -0.098463 0.025159 -0.206449 0.257223 0.123747 0.127422
polarizability: 1.01185712e+02 2.48398360e+00 7.67606249e+01 2.53135834e-02 3.62726363e-02 5.38050987e+01
1716.lowfreq: -201.7223 -4.4305 -0.0017 -0.0014 0.0011 4.4712 9.2768 22.8587 34.1246
frequency: -201.7210 22.7684 33.9538 44.1297 75.6905 107.4807 128.0584 195.0155 199.7951 276.4706 278.0420 322.0722 348.9633 367.4557 369.3590 403.6391 493.7603 597.7839 608.7762 646.8254 673.4366 723.9108 727.1339 815.1635 951.5790 963.9041 988.6945 992.4594 1049.4456 1099.8585 1104.5506 1186.2548 1311.1167 1349.7304 1428.6335 1619.5962 1668.3768 2987.1115 3044.8092 3508.5402 3610.6702 3613.8770
redmass: 1.2828 9.2319 8.0798 9.9956 9.0333 2.5561 3.0410 4.9360 5.0526 4.2376 2.4714 6.1429 6.3372 6.6534 3.9981 6.9160 9.5358 5.1803 1.3399 8.7487 2.6712 7.1390 8.2803 6.8525 7.9682 2.2689 1.2480 1.4503 4.3925 3.6990 2.8966 1.0737 2.1577 1.6473 1.0774 10.7143 10.8648 1.0564 1.1026 1.0644 1.0663 1.0670
irintensity: 59.4236 1.1302 1.9476 1.6255 4.7811 18.9819 103.1108 14.9372 43.1845 33.6716 109.6105 4.5656 33.6413 50.6888 0.8962 1.6023 6.0489 52.4985 110.2160 33.9449 62.6173 332.4021 161.1981 20.5768 459.0342 0.1405 11.2718 17.8050 9.8704 190.4083 146.7333 0.0326 23.4047 4.2036 43.0872 191.8370 79.9913 39.8770 1.7680 46.7020 114.6382 58.5964
temp: 298.150 k
press: 1.00000 atm
elementType: 15 8 8 8 8 8 8 8 6 6 6 1 1 1 1 1
symmnumber: 1
zpe: 244869.0 jmol-1
zpe.correction: 0.093266 hartree
zpe.thermalcorrener: 0.106042 hartree
zpe.thermalcorrenthalpy: 0.106987 hartree
zpe.thermalcorrgfe: 0.051465 hartree
zpe.sumelectzpe: -984.213794 hartree
zpe.sumelectthermal: -984.201017 hartree
zpe.sumelectthermalent: -984.200073 hartree
zpe.sumelectthermalfe: -984.255594 hartree
dipole: -0.3885 -3.8988 0.0302
dipole: 3.9182
quadrupole: -52.6949 -86.5022 -61.3144
quadrupole: -5.7751 0.0673 0.1509
quadrupole: 14.1422 -19.6650 5.5228 -5.7751 0.0673 0.1509
hfenergy: -984.3070594 hartree
pointgroup: C01 [X(C3H5O7P1)]
dipole: 0.1990761 1.5285077 0.0207154 debye
dipolederiv: 2.4564126 -0.0120535 -0.0018181 -0.3879239 1.6375637 -0.0018208 -0.0034434 -0.0054859 2.1352509 -1.6558911 -0.0720377 0.0018113 -0.3524707 -0.3427125 0.0016555 -0.0011137 0.0011933 -0.5276312 -0.5971963 0.1060359 0.0389468 0.2230024 -0.7920309 0.2736211 -0.1217477 0.2295165 -0.979723 -0.605355 0.1121013 -0.0402906 0.2253404 -0.7740023 -0.2748614 0.1214242 -0.2290622 -0.9897626 -0.7142207 -0.0671112 -0.0008111 0.0095255 -0.61209 -0.000304 0.0008225 0.0005563 -0.6470612 -0.4920334 0.0124039 0.000124 0.1271158 -0.6570657 -0.002296 0.0008293 -0.0019458 -0.2409555 -1.1572301 0.4831251 0.0052751 0.3557065 -0.4221752 -0.0008595 0.0045305 -0.0011331 -0.3912299 -0.709712 -0.0935152 -0.0001209 0.2193356 -0.8467004 -0.0050833 0.0023371 -0.0042634 -0.2949434 0.5001693 0.2549136 0.0014715 0.9173074 -0.0937667 -0.0032891 0.0071195 -0.0028083 0.3054136 0.980292 -0.0997074 -0.0006814 -0.376558 0.7985965 0.003241 -0.0027737 0.0030353 0.1862935 1.2422099 -0.322556 -0.004534 -0.4782678 1.0465401 0.0079334 -0.0060874 0.007296 0.2379708 0.0284237 -0.011259 -0.0107253 -0.1143024 0.0829139 -0.0457756 -0.0538203 -0.0555371 0.0199086 0.0282936 -0.0116511 0.0107647 -0.1152025 0.0815872 0.0467586 0.0523239 0.0563174 0.0214256 0.1936089 -0.0876833 -0.027277 -0.0611956 0.3640999 0.0018194 -0.0630095 -0.0099329 0.3805099 0.2009831 -0.0931295 0.0285251 -0.0681245 0.3584398 0.0010431 0.0634892 0.0140543 0.3772292 0.3012453 -0.0978759 -0.0006602 -0.1232884 0.1708027 -0.0017823 -0.0008804 -0.0018005 0.4073046 unknown
polarizability: 101.3132562|1.7428477|76.6326283|-0.062376|0.0975287|53.8055512 unknown
InChI: InChI=1S/C3H5O7P/c4-2(3(5)6)1-10-11(7,8)9/h5,7-8H,1H2
charge 0 multiplicity 1
16 atoms
P  -2.598809 0.064868 0.001081
O  -1.017977 -0.574856 -0.007583
O  -2.509051 1.155922 -1.329558
O  -2.510635 1.131749 1.35218
O  -3.781995 -0.983045 -0.006891
O  1.42551 -1.770953 -0.011967
O  3.827354 -0.415746 -0.008944
O  2.651299 1.596657 0.009518
C  0.133696 0.331916 -0.000899
C  1.394338 -0.528168 -0.005631
C  2.675357 0.343769 -0.000574
H  0.124416 0.981228 0.896992
H  0.125165 0.992667 -0.890332
H  -3.298879 1.14945 -1.926446
H  -3.286703 1.08804 1.96547
H  4.629213 0.176004 -0.005315
