program: Gaussian 09
title: 000078482
version: EM64L-G09RevD.01
frameworkgroup: C1[X(C6H2N2O3)]
method: RPBEPBE
basis: SDD
operation: Freq
keyword: #pfreq=noraman
keyword: PBEPBE/SDD
title: #p freq=noraman PBEPBE/SDD
converged: NO YES NO YES
title: Mulliken charges:
elementType: O O O N N C C C C C C H H
charge: -0.219967 -0.118104 -0.118101 0.064470 0.064470 -0.050724 -0.050723 0.191570 0.191569 -0.242649 -0.242649 0.265418 0.265419
chargesum: 0.00000
title: Mulliken charges with hydrogens summed into heavy atoms:
elementType: O O O N N C C C C C C
charge: -0.219967 -0.118104 -0.118101 0.064470 0.064470 -0.050724 -0.050723 0.191570 0.191569 0.022770 0.022770
polarizability: 1.07431042e+02 7.69879848e-06 1.02528666e+02 -1.11196946e-02 4.64327508e-04 3.31419694e+01
1716.lowfreq: -0.0008 -0.0006 -0.0004 5.2160 10.6471 11.3170 109.3057 152.5463 197.7031
frequency: 109.3051 152.5463 197.7030 263.7114 323.9995 381.3753 427.0545 511.8711 512.2548 582.2978 666.6239 671.6190 678.2675 680.1836 773.3020 813.6787 848.2347 870.9735 970.4759 997.1691 1056.0326 1065.3399 1218.8422 1261.2113 1277.7286 1358.6256 1427.6303 1503.4076 1529.0892 1715.0731 1766.4345 3157.0430 3178.5499
redmass: 7.9280 14.6208 6.3826 9.4744 13.9593 4.2002 11.2649 10.7561 11.8386 13.8992 11.5223 5.4145 8.4240 11.4671 14.0810 10.6854 8.3707 1.2624 1.5268 6.2070 3.7353 6.6886 3.7791 2.4910 10.1465 2.0598 1.9311 12.0751 6.7488 13.1429 13.0109 1.0899 1.0984
irintensity: 0.0000 1.6525 0.0070 0.8939 5.4763 0.0000 23.4473 12.0996 0.5409 0.5376 14.8992 0.0000 22.4777 0.4353 242.8341 0.0001 14.8433 19.0095 0.0000 35.0269 125.5368 10.6134 2.9583 0.1570 21.8454 28.5617 11.6663 6.4792 0.1025 446.5809 81.8248 0.0644 14.3807
temp: 298.150 k
press: 1.00000 atm
elementType: 8 8 8 7 7 6 6 6 6 6 6 1 1
symmnumber: 1
zpe: 197070.7 jmol-1
zpe.correction: 0.075060 hartree
zpe.thermalcorrener: 0.082871 hartree
zpe.thermalcorrenthalpy: 0.083815 hartree
zpe.thermalcorrgfe: 0.042022 hartree
zpe.sumelectzpe: -564.224695 hartree
zpe.sumelectthermal: -564.216885 hartree
zpe.sumelectthermalent: -564.215940 hartree
zpe.sumelectthermalfe: -564.257733 hartree
dipole: -5.8736 0.0000 0.0028
dipole: 5.8736
quadrupole: -57.0857 -78.3511 -58.7525
quadrupole: 0.0000 0.0046 0.0000
quadrupole: 7.6441 -13.6214 5.9773 0.0000 0.0046 0.0000
hfenergy: -564.2997554 hartree
pointgroup: C01 [X(C6H2N2O3)]
dipole: 2.3108391 -0.0000897 -0.0010988 debye
dipolederiv: -0.6731044 -0.0000262 -0.0000733 -0.0000238 -1.4571025 0.0000137 0.0001913 0.0000418 -0.2243163 -0.5350769 0.2679059 -0.0000329 0.1802262 -0.9541069 0.000163 0.0001647 -0.0003599 -0.2676495 -0.5351047 -0.267938 -0.0000156 -0.1802548 -0.9540831 -0.0001188 0.000149 0.0003416 -0.2676466 -0.1997789 -0.107322 0.0000088 0.0427813 -0.1011602 -0.0000006 -0.0000386 0.0000733 -0.2263313 -0.1997732 0.1073328 0.0000093 -0.0427744 -0.1011676 -0.0000021 -0.0000076 -0.0000596 -0.2263311 -0.1617903 0.1989017 0.0001305 -0.1514282 -0.0697136 0.0000165 -0.0000789 -0.000039 0.1290333 -0.1617934 -0.1989006 0.0001112 0.1514346 -0.0697126 -0.0000127 -0.0000812 0.0000461 0.1290323 1.0767928 0.0237964 -0.0000807 -0.1483453 1.7274656 -0.0002009 -0.0001721 -0.0000548 0.2989677 1.0768016 -0.0237467 -0.0000852 0.1483873 1.7274697 0.0001383 -0.0001612 0.0000207 0.2989679 0.1802884 0.0813587 0.000001 0.4329783 0.0380744 -0.0000226 0.0000386 -0.0000264 0.0463777 0.1802528 -0.0813683 -0.0000016 -0.4329878 0.0381043 0.0000258 0.0000205 0.0000111 0.0463776 -0.023861 -0.036494 0.0000139 -0.0648737 0.0879694 -0.0000016 -0.0000069 -0.0000259 0.1317588 -0.0238526 0.0365003 0.0000145 0.0648803 0.0879631 0.0000019 -0.0000175 0.0000312 0.1317594 unknown
polarizability: 107.431042|-0.0001637|102.5286656|-0.0111197|-0.000464|33.1419694 unknown
InChI: InChI=1S/C6H2N2O3/c9-5-3-4(6(10)11-5)8-2-1-7-3/h1-2H
charge 0 multiplicity 1
13 atoms
O  -2.080347 0.000084 0.000497
O  -1.726001 2.330222 0.000415
O  -1.726152 -2.330079 0.000455
N  1.303738 1.458684 -0.000309
N  1.303645 -1.458734 -0.000301
C  0.172621 0.70672 -0.000385
C  0.172578 -0.706699 -0.000374
C  -1.244914 1.199751 -0.000249
C  -1.244988 -1.199642 -0.00017
C  2.453114 0.713043 -0.000405
C  2.45307 -0.713167 -0.000406
H  3.39476 1.270022 -0.000436
H  3.394679 -1.270207 -0.000432
