program: Gaussian 09
title: 000078475
version: EM64L-G09RevD.01
frameworkgroup: C1[X(C4H8O3)]
method: RPBEPBE
basis: SDD
operation: Freq
keyword: #p
keyword: freq=noraman
keyword: PBEPBE/SDD
title: #p freq=noraman PBEPBE/SDD
converged: NO NO NO NO
title: Mulliken charges:
elementType: O O O C C C C H H H H H H H H
charge: -0.234496 -0.234489 -0.432197 -0.076681 -0.355384 -0.355379 -0.215325 0.222719 0.260930 0.186647 0.186645 0.260928 0.241490 0.188679 0.355912
chargesum: 0.00000
title: Mulliken charges with hydrogens summed into heavy atoms:
elementType: O O O C C C C
charge: -0.234496 -0.234489 -0.076285 0.146039 0.092193 0.092194 0.214844
polarizability: 5.42360625e+01 1.79412498e-04 4.84539740e+01 2.21309146e+00 1.52075727e-04 4.82250239e+01
1716.lowfreq: -0.0013 -0.0012 -0.0007 12.7746 21.3883 30.7712 161.3871 183.4200 320.4316
frequency: 161.3609 183.3639 320.4307 376.7897 424.3671 430.9160 492.9462 542.7367 756.3758 786.8755 818.0359 892.5704 902.9795 936.7260 942.3258 1014.4116 1070.4694 1102.9837 1136.5271 1181.5152 1213.5580 1261.9828 1286.6221 1294.9504 1339.1049 1365.7025 1371.4072 1381.4698 1438.6349 1443.4812 1452.7269 2898.4909 2942.4537 2952.9204 3049.1460 3106.1324 3108.7668 3133.0224 3526.0765
redmass: 4.0639 4.0175 2.5334 2.1048 1.8431 1.2973 5.3019 4.7368 4.9328 4.1683 3.8704 2.2504 3.9182 3.7337 2.9865 2.8065 1.7966 2.6902 1.6775 1.0560 1.2456 1.2644 1.6069 1.3796 1.2048 1.3155 1.1629 1.1771 1.0836 1.0830 1.1011 1.0686 1.0684 1.0685 1.0863 1.0946 1.0965 1.0970 1.0651
irintensity: 4.5232 9.0061 9.0173 7.6210 10.6594 99.0913 21.2165 8.6389 19.4745 19.5150 56.7264 57.3532 8.7550 64.3430 16.5017 103.7054 11.2567 71.5015 29.4681 11.6430 37.8707 0.0040 0.1902 2.6528 0.8854 3.4476 39.9051 1.4462 12.4863 1.2682 16.6692 90.8062 16.7671 115.3333 39.9632 18.1248 15.8605 18.3717 8.8672
temp: 298.150 k
press: 1.00000 atm
elementType: 8 8 8 6 6 6 6 1 1 1 1 1 1 1 1
symmnumber: 1
zpe: 323239.1 jmol-1
zpe.correction: 0.123115 hartree
zpe.thermalcorrener: 0.129559 hartree
zpe.thermalcorrenthalpy: 0.130503 hartree
zpe.thermalcorrgfe: 0.093038 hartree
zpe.sumelectzpe: -382.276644 hartree
zpe.sumelectthermal: -382.270200 hartree
zpe.sumelectthermalent: -382.269256 hartree
zpe.sumelectthermalfe: -382.306721 hartree
dipole: -0.9853 -0.0001 2.8058
dipole: 2.9738
quadrupole: -45.0224 -45.0074 -39.0160
quadrupole: 0.0001 2.0689 0.0001
quadrupole: -2.0071 -1.9921 3.9992 0.0001 2.0689 0.0001
hfenergy: -382.3997593 hartree
pointgroup: C01 [X(C4H8O3)]
dipole: -0.3606119 0.000054 -1.1130127 debye
dipolederiv: -0.7593874 -0.2166912 0.0738631 -0.0837246 -0.747249 0.0760091 0.0408244 0.0593164 -0.4405133 -0.7593371 0.216698 0.0738613 0.0837329 -0.7473068 -0.0760253 0.0408215 -0.059337 -0.4405179 -0.3368461 -0.0000352 -0.2386304 -0.0000323 -0.6217964 0.0000237 -0.2738047 0.0000236 -0.6464034 0.2415086 0.0000026 0.1455472 -0.000001 0.2461108 -0.0000057 0.2086825 -0.0000064 0.525362 0.4359431 0.0784663 -0.1374011 0.023453 0.155443 -0.0140452 -0.1496479 -0.1523299 0.3607437 0.4359426 -0.0785245 -0.1374103 -0.0235075 0.1554567 0.0140727 -0.1496325 0.1523603 0.3607623 0.776371 0.0000256 0.074113 0.0000284 1.0824988 -0.0000074 0.2135587 -0.0000138 0.4966641 -0.0803193 0.0000173 0.1168612 0.0000187 0.0828876 -0.0000159 0.0625088 -0.0000092 -0.0560973 0.0171791 -0.0864017 0.0179942 -0.0802176 -0.0611246 -0.0139524 -0.0024341 -0.0534292 0.081626 -0.0334839 0.0260651 -0.1013989 0.0299974 0.0788676 -0.0132298 -0.0140166 0.0622159 -0.2099773 -0.0334918 -0.0260444 -0.1013873 -0.0299805 0.0788747 0.0132424 -0.0140177 -0.0622213 -0.2099919 0.0172055 0.0863905 0.0179937 0.0802053 -0.0611538 0.013954 -0.0024282 0.0534329 0.0816243 -0.0565735 0.0000102 0.065944 0.0000082 0.0500877 -0.000005 0.1178447 -0.0000114 0.0198517 -0.0105967 -0.000003 -0.0325615 -0.0000009 -0.0504811 0.0000057 -0.2029091 0.000024 -0.1939272 0.1458859 0.0000245 0.1626117 0.0000206 0.3588849 -0.0000208 0.1246502 -0.0000148 0.2707942 unknown
polarizability: 54.3404194|-0.0005723|48.4539741|-2.0638773|0.0002921|48.1206669 unknown
InChI: InChI=1S/C4H8O3/c5-4-1-6-3-7-2-4/h4-5H,1-3H2
charge 0 multiplicity 1
15 atoms
O  -0.890702 1.211558 0.339922
O  -0.890946 -1.211399 0.339897
O  1.793546 -0.000138 0.891795
C  1.133457 -0.0001 -0.416802
C  0.257002 1.260619 -0.596645
C  0.256766 -1.260665 -0.596624
C  -1.670108 0.000159 0.104426
H  1.957497 -0.000194 -1.152808
H  0.818036 2.168467 -0.328643
H  -0.113417 1.334208 -1.643502
H  -0.113625 -1.33421 -1.643494
H  0.817641 -2.168605 -0.328597
H  -2.484039 0.000234 0.841327
H  -2.046249 0.000208 -0.947332
H  1.077041 -0.000044 1.580781
