program: Gaussian 09
title: 000078471
version: EM64L-G09RevD.01
frameworkgroup: C1[X(C3H6N4S)]
method: RPBEPBE
basis: SDD
operation: Freq
keyword: #pfreq=noraman
keyword: PBEPBE/SDD
title: #p freq=noraman PBEPBE/SDD
converged: YES YES NO NO
title: Mulliken charges:
elementType: S N N N N C C C H H H H H H
charge: 0.258083 -0.432207 -0.112991 -0.028011 -0.617837 0.224307 -0.240285 -0.835878 0.325379 0.344341 0.320389 0.240172 0.277849 0.276690
chargesum: 0.00000
title: Mulliken charges with hydrogens summed into heavy atoms:
elementType: S N N N N C C C
charge: 0.258083 -0.106828 -0.112991 -0.028011 0.046892 0.224307 -0.240285 -0.041166
polarizability: 1.07798453e+02 -1.57619739e+00 7.77684774e+01 1.13704136e-02 1.64677655e-02 3.62576537e+01
1716.lowfreq: -11.7519 -8.8190 -0.0033 -0.0009 -0.0007 5.9132 39.9032 116.3109 158.9381
frequency: 39.8656 116.2756 158.9381 180.3544 186.7239 297.8383 319.3317 411.6380 412.6558 453.2808 563.2903 645.7031 662.1729 707.3067 728.5326 917.8645 980.7749 988.9839 993.4116 1027.3705 1063.8657 1244.1368 1302.9911 1346.8201 1351.5362 1424.5110 1436.0188 1456.1237 1585.5658 1640.0853 3024.0210 3147.0717 3154.1029 3581.6934 3623.7045 3727.2247
redmass: 3.9760 1.0862 3.3920 4.4892 1.1683 3.9361 7.6633 1.1625 5.4210 5.3874 1.3137 5.3707 7.2951 8.6545 6.5368 8.7576 1.1733 1.7506 1.5045 3.7252 4.9974 7.9587 2.8717 1.8820 1.2585 4.5286 1.0531 1.0676 1.5723 2.4981 1.0282 1.1040 1.1058 1.0453 1.0825 1.1052
irintensity: 3.0937 1.6427 3.2607 5.6174 109.0805 9.8846 0.1657 212.7878 7.7697 1.9854 169.7395 10.6261 1.3752 0.2033 5.8790 4.0633 8.7325 3.8352 17.7849 11.5581 6.7306 134.5811 70.7240 2.9034 10.3310 117.9147 13.1990 15.8338 30.0953 423.1862 24.7014 11.0609 13.6795 90.9791 50.2788 48.0594
temp: 298.150 k
press: 1.00000 atm
elementType: 16 7 7 7 7 6 6 6 1 1 1 1 1 1
symmnumber: 1
zpe: 268572.3 jmol-1
zpe.correction: 0.102294 hartree
zpe.thermalcorrener: 0.111119 hartree
zpe.thermalcorrenthalpy: 0.112064 hartree
zpe.thermalcorrgfe: 0.067943 hartree
zpe.sumelectzpe: -734.352864 hartree
zpe.sumelectthermal: -734.344039 hartree
zpe.sumelectthermalent: -734.343094 hartree
zpe.sumelectthermalfe: -734.387215 hartree
dipole: 4.8860 2.5086 0.0041
dipole: 5.4924
quadrupole: -32.6238 -54.4016 -57.6427
quadrupole: -3.6549 -0.0389 0.0094
quadrupole: 15.5989 -6.1789 -9.4200 -3.6549 -0.0389 0.0094
hfenergy: -734.455158 hartree
pointgroup: C01 [X(C3H6N4S1)]
dipole: -1.8849453 -1.0565506 -0.0034452 debye
dipolederiv: -0.4249629 0.1936354 0.0180336 0.0486513 0.0244972 0.0030045 0.0135473 -0.0026922 -0.0726588 -0.5469177 0.3424311 0.024047 -0.1607716 -0.3340941 0.0026307 -0.0018858 -0.0102698 -0.3000163 -1.2189225 -0.2977183 0.0100814 -0.1428096 -0.5359518 -0.0123207 0.0195215 -0.0088124 -0.2316368 -0.212416 -0.0721957 -0.0025378 0.2726435 -0.5356597 -0.0264941 0.0156927 -0.0172906 -0.1665784 -1.0507341 -0.5824678 -0.0204773 -0.6424855 -0.6548428 0.0198689 -0.021532 0.0198766 -0.7459483 1.4150644 0.5437653 -0.0032411 0.4516289 0.9522674 0.0265025 -0.0087804 0.02336 0.2314142 1.3493268 -0.0139917 -0.036613 0.1575196 0.3286288 0.0165919 -0.0289461 0.0212075 -0.03942 0.0577407 -0.1331012 -0.0063926 -0.106951 0.1586151 0.0045652 -0.0061465 0.006849 0.0547006 0.1580941 -0.017725 0.0047761 -0.012603 0.2038451 -0.0089531 0.0050107 -0.0087903 0.3785048 0.1710653 0.020897 0.0066497 0.0570473 0.2458403 -0.0096891 0.0087083 -0.0087904 0.4077309 0.2246369 0.0412653 0.0062792 0.0076236 0.1511202 -0.0129657 0.0029338 -0.0146559 0.411779 -0.1377894 0.0403325 0.0114604 0.0193456 0.0796542 -0.0018553 0.0096684 -0.0026617 0.126674 0.1048589 -0.0322546 -0.0766223 0.0238882 -0.0349743 -0.0767523 -0.0537717 -0.063432 -0.0277867 0.1109556 -0.0328724 0.0645567 0.0272726 -0.0489455 0.0758667 0.04598 0.0661021 -0.0267582 unknown
polarizability: 107.8273643|-0.4033022|77.5929638|-1.8275954|2.0427608|36.4042563 unknown
InChI: InChI=1S/C3H6N4S/c1-8-3-5-2(4)6-7-3/h6H,4H2,1H3
charge 0 multiplicity 1
14 atoms
S  2.380992 0.635161 -0.133967
N  -1.490378 1.051329 -0.008389
N  -0.107161 -0.704142 -0.136354
N  -0.191513 1.627728 -0.01143
N  -2.484884 -1.186283 -0.099192
C  -1.411213 -0.324799 -0.082752
C  0.580205 0.509514 -0.091173
C  2.794563 -1.198795 -0.224723
H  -2.292907 1.672907 0.045085
H  -2.288681 -2.181081 -0.154202
H  -3.446193 -0.864836 -0.062376
H  3.893829 -1.248789 -0.268514
H  2.34643 -1.638211 -1.126432
H  2.41531 -1.712903 0.669218
