program: Gaussian 09
title: 000078480
version: EM64L-G09RevD.01
frameworkgroup: C1[X(C8H4ClNO3)]
method: RPBEPBE
basis: SDD
operation: Freq
keyword: #p
keyword: freq=noraman
keyword: PBEPBE/SDD
title: #p freq=noraman PBEPBE/SDD
converged: NO NO NO NO
title: Mulliken charges:
elementType: Cl O O O N C C C C C C C C H H H H
charge: -0.023730 -0.221812 -0.177598 -0.187880 -0.459153 0.406270 0.097779 -0.371296 -0.285413 0.164876 -0.162195 -0.133463 0.191051 0.246264 0.299406 0.349840 0.267054
chargesum: 0.00000
title: Mulliken charges with hydrogens summed into heavy atoms:
elementType: Cl O O O N C C C C C C C C
charge: -0.023730 -0.221812 -0.177598 -0.187880 -0.109313 0.406270 0.097779 -0.125032 0.013993 0.164876 0.104859 -0.133463 0.191051
polarizability: 1.80525909e+02 -5.15442474e+00 1.19667622e+02 -3.85458359e-03 -4.89989929e-03 4.19861945e+01
1716.lowfreq: 0.0005 0.0007 0.0024 5.2681 11.4164 20.0123 59.9541 131.7955 152.4417
frequency: 59.9348 131.7777 152.4414 159.6512 166.9111 301.4868 332.6641 339.1633 367.3949 426.0043 449.5315 501.5799 526.3056 545.2794 612.4582 632.3492 664.0205 676.1279 711.7741 749.4273 761.3787 824.6284 872.4120 887.3795 923.0703 944.7723 957.0250 1069.7768 1130.3864 1149.2347 1213.5077 1258.3183 1285.5388 1370.7777 1410.7302 1455.7277 1479.8649 1590.8630 1617.5584 1672.7962 1726.2905 3145.0910 3172.8962 3175.6122 3545.8304
redmass: 12.4390 11.7638 6.1334 6.6730 15.2979 14.8072 7.5506 5.9553 12.9236 3.7290 8.4782 10.0513 3.5889 9.1442 7.7080 1.6397 5.8590 7.4917 2.9537 5.0654 8.9156 1.4816 10.3488 5.5195 1.4073 8.8639 1.3551 1.9752 2.1296 3.4980 2.3492 1.5547 2.1992 3.5462 4.6135 2.2713 3.4765 7.0472 7.1992 11.6445 9.1662 1.0902 1.0933 1.0963 1.0774
irintensity: 2.0801 0.0859 0.4973 2.1830 4.2186 1.3183 3.1336 0.1441 8.0268 0.7595 2.9195 27.2759 34.4568 2.8905 32.1578 28.7893 8.0966 5.0354 75.4697 2.8789 25.8341 71.7454 127.5253 35.4525 10.1689 44.4231 2.1429 12.9186 54.1504 31.0280 105.8158 31.3185 97.7601 31.1308 24.6302 4.0531 225.9973 3.4054 44.4159 464.8625 679.5337 5.2754 2.5781 3.1149 60.2719
temp: 298.150 k
press: 1.00000 atm
elementType: 17 8 8 8 7 6 6 6 6 6 6 6 6 1 1 1 1
symmnumber: 1
zpe: 282006.2 jmol-1
zpe.correction: 0.107410 hartree
zpe.thermalcorrener: 0.117614 hartree
zpe.thermalcorrenthalpy: 0.118558 hartree
zpe.thermalcorrgfe: 0.070840 hartree
zpe.sumelectzpe: -1046.857670 hartree
zpe.sumelectthermal: -1046.847467 hartree
zpe.sumelectthermalent: -1046.846522 hartree
zpe.sumelectthermalfe: -1046.894240 hartree
dipole: -3.7324 -5.6854 0.0020
dipole: 6.8011
quadrupole: -103.4973 -77.1991 -80.8026
quadrupole: -4.6829 0.0049 0.0036
quadrupole: -16.3310 9.9672 6.3637 -4.6829 0.0049 0.0036
hfenergy: -1046.96508 hartree
pointgroup: C01 [X(C8H4Cl1N1O3)]
dipole: 1.5878611 2.1536906 0.000795 debye
dipolederiv: -0.8029141 0.1618838 -0.000013 0.2242382 -0.1424781 0.0000057 -0.0000195 -0.0000018 -0.0449794 -1.0503208 0.580798 0.0001253 0.5682686 -1.0465869 0.0000396 -0.0001529 0.0000598 -0.2440949 -0.518234 0.0198832 -0.0000091 -0.080925 -1.203693 0.0000754 0.0000454 -0.0005491 -0.3153157 -1.5501378 0.2416557 -0.0000092 0.3783805 -0.563395 0.0000111 -0.0004286 0.000121 -0.3518011 -1.6004862 0.1660509 -0.0000904 -0.2951119 -0.4017446 -0.0000896 -0.000087 -0.0000416 -0.3139081 1.114532 -0.3797659 -0.0000114 -0.1768921 0.1326979 -0.0000272 0.0001628 0.0000892 0.1179462 -0.5145749 -0.3744893 -0.0000717 -0.1112509 -0.3566716 -0.0000545 0.0000957 0.0000053 -0.0280125 -0.3745377 0.1420404 0.0000005 -0.1136834 0.1350105 0.0000293 0.0000439 -0.0000158 -0.1832616 -0.1237292 0.305226 0.0000027 -0.0698968 0.0389926 -0.0000084 -0.0000185 0.0000169 -0.0304896 1.5240928 -0.1372958 -0.0000788 0.1356007 1.7039675 0.0000719 -0.0000634 0.00037 0.322204 -0.0992391 -0.0332367 -0.0000342 0.1189217 0.1676287 -0.0000048 -0.0000437 -0.0000156 -0.0540898 1.1613945 -0.3978738 0.0000206 -0.4104411 -0.1253353 -0.0000209 0.000034 0.0000149 -0.0975071 2.4728307 -0.2359339 0.0001708 -0.1429841 1.3754217 -0.0000518 0.0004693 -0.0001012 0.3811813 0.049211 0.0737041 0.0000042 0.039113 -0.0524009 -0.0000041 -0.0000173 0.0000004 0.1750512 0.1265006 -0.0112468 -0.0000022 0.0380597 0.0641651 0.0000076 0.0000072 -0.0000024 0.1620413 0.1561745 -0.0553056 -0.0000096 -0.0446799 0.2110215 0.0000146 -0.0000409 0.0000373 0.3449822 0.0294379 -0.0660943 0.0000055 -0.0567174 0.0633999 0.0000064 0.0000134 0.0000127 0.1600536 unknown
polarizability: 179.7865297|-8.4272641|120.4070019|0.0041152|0.0046831|41.9861945 unknown
InChI: InChI=1S/C8H4ClNO3/c9-4-1-2-6-5(3-4)7(11)13-8(12)10-6/h1-3,10H
charge 0 multiplicity 1
17 atoms
Cl 4.28635 -0.570952 0.000044
O  -2.255421 -0.877115 -0.000011
O  -0.833986 -2.685809 -0.00065
O  -3.727404 0.915272 -0.000404
N  -1.433945 1.354338 0.000119
C  -0.096347 0.924941 0.000125
C  0.179881 -0.472352 0.00007
C  0.973086 1.855355 0.00006
C  1.519497 -0.935211 0.00005
C  -0.928452 -1.449717 0.000233
C  2.301691 1.392905 0.000014
C  2.56065 0.001538 0.000008
C  -2.553854 0.517956 0.000057
H  0.773197 2.932284 0.000068
H  1.70375 -2.013624 0.000071
H  -1.646358 2.354679 -0.000002
H  3.133666 2.103213 -0.00005
