program: Gaussian 09
title: 000078467
version: EM64L-G09RevD.01
frameworkgroup: C1[X(C8H4N2O2)]
method: RPBEPBE
basis: SDD
operation: Freq
keyword: #pfreq=noraman
keyword: PBEPBE/SDD
title: #p freq=noraman PBEPBE/SDD
converged: NO YES NO YES
title: Mulliken charges:
elementType: O O N N C C C C C C C C H H H H
charge: -0.394029 -0.394299 0.007808 0.000499 0.248854 0.202739 0.065170 0.130248 -0.311917 -0.346464 -0.280753 -0.196554 0.270099 0.238490 0.388387 0.371721
chargesum: 0.00000
title: Mulliken charges with hydrogens summed into heavy atoms:
elementType: O O N N C C C C C C C C
charge: -0.005642 -0.022578 0.007808 0.000499 0.248854 0.202739 0.065170 0.130248 -0.041818 -0.107974 -0.280753 -0.196554
polarizability: 1.31631976e+02 3.56480216e+00 1.44954100e+02 -7.46506819e-03 -7.63011637e-03 4.05272648e+01
1716.lowfreq: -7.0705 -0.0006 0.0001 0.0003 1.3928 6.4219 81.4776 111.2423 133.7946
frequency: 81.4737 111.2422 133.7946 150.2534 173.4381 307.9633 330.1667 342.1577 371.2856 377.4444 433.6049 436.0560 445.2344 464.0325 500.6300 577.7702 597.9787 616.5710 637.8300 731.0874 780.9728 816.9208 919.5472 943.3620 984.9910 1137.3210 1160.9009 1169.7758 1229.1760 1268.4674 1322.7211 1386.9820 1431.3205 1487.9405 1582.1842 1618.6817 2164.9755 2185.2136 3137.3867 3186.0248 3519.8015 3586.9513
redmass: 11.1598 13.4910 5.7983 9.7375 7.7715 5.9109 2.0173 1.9296 8.2703 5.6844 1.1326 9.5031 8.3103 5.0615 11.1199 5.4067 7.4153 4.9687 5.0860 8.0765 8.0003 1.5084 7.8873 1.3615 4.2685 1.5542 1.3372 1.5939 3.0713 2.4414 2.8853 7.9461 4.4789 3.4932 7.0988 6.9302 12.6160 12.6271 1.0906 1.0952 1.0660 1.0665
irintensity: 0.0041 1.2898 0.0069 2.7692 0.1135 20.7532 84.3075 58.1519 0.5320 0.0049 151.7653 1.3011 0.7419 28.5509 0.6700 0.0433 5.8649 3.1145 11.8953 17.7710 0.1851 45.4962 85.9807 0.2232 30.1005 11.9820 346.0035 29.7855 9.9431 74.4334 9.9356 62.8658 104.0511 76.8478 6.6127 3.1216 27.1495 8.4191 7.4149 0.6109 56.4455 69.2314
temp: 298.150 k
press: 1.00000 atm
elementType: 8 8 7 7 6 6 6 6 6 6 6 6 1 1 1 1
symmnumber: 1
zpe: 268212.5 jmol-1
zpe.correction: 0.102157 hartree
zpe.thermalcorrener: 0.112667 hartree
zpe.thermalcorrenthalpy: 0.113611 hartree
zpe.thermalcorrgfe: 0.066205 hartree
zpe.sumelectzpe: -566.337827 hartree
zpe.sumelectthermal: -566.327317 hartree
zpe.sumelectthermalent: -566.326373 hartree
zpe.sumelectthermalfe: -566.373779 hartree
dipole: -0.6305 -7.3490 0.0008
dipole: 7.3760
quadrupole: -67.8265 -75.1378 -69.2514
quadrupole: 11.4397 0.0007 0.0003
quadrupole: 2.9121 -4.3992 1.4871 11.4397 0.0007 0.0003
hfenergy: -566.4399837 hartree
pointgroup: C01 [X(C8H4N2O2)]
dipole: 0.0589714 2.9013592 0.0002971 debye
dipolederiv: -1.3878418 0.2053825 -0.0000128 -0.0626444 -0.0631521 0.0000031 -0.0000342 0.0000218 -0.3973793 -1.3904603 -0.3727852 -0.0000541 -0.1044775 -0.0287969 0.0000295 -0.0000097 0.0000216 -0.3893537 -0.273932 -0.1120671 0.0000553 -0.0382083 -0.2917684 0.0001148 0.0000123 0.0000127 -0.2217834 -0.192595 0.0422926 0.0000189 0.0170741 -0.2698529 -0.0000237 0.0000116 -0.0000044 -0.2276657 -0.0104954 -0.4172058 -0.000035 0.1240965 -0.0782257 -0.0000136 -0.0000024 -0.0000278 0.0627203 0.0515651 0.3917661 0.0000207 -0.2167093 0.0758134 -0.0000069 0.0000046 0.0000359 0.1096328 1.2559153 -0.246422 0.000016 0.1478698 -0.2634338 -0.0000096 0.0000822 0.0000005 0.0688346 1.2884785 0.3965472 0.0000575 0.102121 -0.3045645 -0.0000297 0.0000173 -0.0000112 0.0607069 -0.1750579 0.3139768 0.0000113 -0.2593323 0.236116 0.0000131 -0.0000182 0.0000136 -0.1239935 -0.1610781 -0.3388103 -0.0000179 0.2141048 0.2335232 0.0000301 0.0000219 0.0000233 -0.1583147 0.0546188 0.2464508 -0.0000249 0.1512175 0.2980619 -0.0000793 -0.0000262 -0.000038 0.0375911 -0.0061219 -0.1137967 -0.0000183 -0.0474177 0.2278095 0.0000235 -0.0000219 0.0000188 0.0503856 0.0659481 0.056287 -0.0000004 0.0438535 0.0243963 -0.0000083 -0.0000085 -0.0000098 0.1732673 0.0132455 -0.1022367 -0.0000126 -0.0675591 -0.0152143 -0.0000118 -0.0000091 -0.0000146 0.1713852 0.4351276 -0.038476 -0.0000125 -0.0111776 0.1197265 -0.0000058 -0.0000129 -0.0000145 0.3894882 0.4326836 0.0890968 0.0000087 0.0071891 0.0995619 -0.0000253 -0.0000068 -0.0000278 0.3944783 unknown
polarizability: 131.2246425|2.6674603|145.3614337|0.0069515|0.0081007|40.5272648 unknown
InChI: InChI=1S/C8H4N2O2/c9-3-5-6(4-10)8(12)2-1-7(5)11/h1-2,11-12H
charge 0 multiplicity 1
16 atoms
O  -2.812237 1.02211 -0.000075
O  2.811198 0.97198 0.000091
N  -2.115182 -2.467572 -0.000594
N  2.106357 -2.486776 0.000032
C  -0.689812 -0.257052 -0.000063
C  0.74419 -0.237734 -0.000019
C  -1.422723 0.965329 -0.000025
C  1.41818 1.011616 0.000063
C  -0.729393 2.198152 0.000048
C  0.673858 2.219691 0.000093
C  -1.431505 -1.484102 -0.000128
C  1.491549 -1.46127 -0.000038
H  -1.310191 3.123811 0.000081
H  1.196747 3.183494 0.000165
H  -3.224069 0.11797 -0.000118
H  3.205735 1.879153 0.000186
