program: Gaussian 09
title: 000078479
version: EM64L-G09RevD.01
frameworkgroup: C1[X(C7H20N4)]
method: RPBEPBE
basis: SDD
operation: Freq
keyword: #pfreq=noraman
keyword: PBEPBE/SDD
title: #p freq=noraman PBEPBE/SDD
converged: YES YES NO NO
title: Mulliken charges:
elementType: N N N N C C C C C C C H H H H H H H H H H H H H H H H H H H H
charge: -0.285584 -0.285597 -0.580029 -0.580026 -0.411111 -0.353629 -0.353641 -0.333904 -0.333883 -0.392427 -0.392436 0.167948 0.240297 0.173162 0.205057 0.205045 0.173197 0.234561 0.234574 0.193588 0.204822 0.204787 0.193576 0.192064 0.207188 0.207171 0.192093 0.275434 0.261136 0.261135 0.275431
chargesum: 0.00000
title: Mulliken charges with hydrogens summed into heavy atoms:
elementType: N N N N C C C C C C C
charge: -0.051023 -0.051023 -0.043459 -0.043460 -0.002866 0.024591 0.024601 0.064506 0.064480 0.006825 0.006828
polarizability: 1.46011073e+02 2.19160186e-03 9.39212694e+01 4.52889300e-03 3.60174165e+00 8.28807702e+01
1716.lowfreq: -30.5111 -9.9101 -2.6095 -0.0010 0.0005 0.0006 20.0017 32.2134 41.1317
frequency: 19.6412 32.1322 41.1127 54.3535 90.2260 102.2479 108.6758 130.1164 146.2953 159.3369 190.6325 209.2758 213.9874 232.1552 326.7019 395.6655 415.7918 508.4584 516.6660 601.2903 601.3876 673.1782 686.0961 768.4762 803.7291 805.3993 874.9345 951.3762 953.9136 1010.7453 1014.3826 1056.3185 1060.0383 1070.9026 1072.7899 1097.0725 1109.8616 1116.8026 1122.5969 1141.4496 1154.5477 1209.3513 1216.6195 1243.3750 1243.4632 1262.2009 1268.1420 1275.8180 1282.3480 1283.5153 1314.5234 1329.5379 1366.0981 1375.3776 1394.4028 1397.6845 1449.7998 1451.8769 1468.9412 1479.8250 1482.4338 1489.9287 1492.9922 1496.2692 1500.6408 1641.3495 1641.4097 2836.8248 2847.7263 2889.8021 2890.3063 2912.9124 2913.2079 2948.2439 2980.7378 2980.8970 2989.6966 2996.5796 3012.2698 3012.4302 3060.1485 3414.5826 3414.6326 3462.8882 3462.8962 3590.1540 3590.1937
redmass: 4.2826 1.6172 4.2578 4.0634 1.7457 3.4071 2.7858 1.9913 2.6129 2.4156 1.8082 1.1143 3.3174 1.7419 3.0869 4.1958 3.0491 3.9604 2.8399 1.2985 1.3142 1.3156 1.2683 1.0805 1.1055 1.1092 1.2061 1.8002 1.9609 2.2269 3.5743 2.2574 2.2605 2.6061 1.6978 2.2467 2.1747 2.2575 1.2504 4.0772 4.2924 1.8603 1.4192 1.2624 1.2979 1.2583 1.1976 1.0854 1.1073 1.1369 1.2558 1.3448 1.3450 1.4921 1.4914 1.5431 1.2043 1.2155 1.0733 1.0814 1.0793 1.0874 1.0919 1.0849 1.0851 1.0933 1.0933 1.0716 1.0712 1.0681 1.0682 1.0670 1.0669 1.0688 1.0887 1.0887 1.0868 1.0834 1.0963 1.0963 1.0952 1.0737 1.0737 1.0450 1.0450 1.0976 1.0976
irintensity: 0.1100 0.3667 0.2902 0.4800 10.4690 0.3152 1.5655 3.6388 4.6814 7.3014 34.2374 40.9987 7.3849 31.0808 20.7945 2.2037 4.0842 19.6529 3.3222 447.4589 30.5577 0.9287 185.9821 4.9564 1.2062 3.9404 2.5024 0.9217 0.0247 0.0839 2.3873 2.5947 2.2032 16.6830 2.2051 2.6618 7.2557 1.6781 71.6645 117.3827 0.4379 3.9367 0.3065 8.5725 4.6491 1.0076 0.4656 2.5575 1.3090 0.6783 0.4940 11.5412 2.9221 2.4639 0.3428 16.2113 52.4011 0.6032 3.3061 5.7385 0.1911 7.5003 1.5963 1.2424 5.5590 48.8022 32.4513 36.0189 171.5463 18.7012 67.7173 51.9472 259.1712 20.3853 2.5814 7.6376 0.0667 83.1722 9.6470 175.7140 46.2101 2.7921 3.3113 0.7385 1.1414 0.3029 0.3612
temp: 298.150 k
press: 1.00000 atm
elementType: 7 7 7 7 6 6 6 6 6 6 6 1 1 1 1 1 1 1 1 1 1 1 1 1 1 1 1 1 1 1 1
symmnumber: 1
zpe: 735140.0 jmol-1
zpe.correction: 0.280000 hartree
zpe.thermalcorrener: 0.295542 hartree
zpe.thermalcorrenthalpy: 0.296486 hartree
zpe.thermalcorrgfe: 0.234844 hartree
zpe.sumelectzpe: -496.746637 hartree
zpe.sumelectthermal: -496.731095 hartree
zpe.sumelectthermalent: -496.730151 hartree
zpe.sumelectthermalfe: -496.791792 hartree
dipole: 0.0001 0.6172 -0.2215
dipole: 0.6558
quadrupole: -57.3567 -69.6633 -71.3593
quadrupole: -0.0148 -0.0068 7.1645
quadrupole: 8.7697 -3.5369 -5.2329 -0.0148 -0.0068 7.1645
hfenergy: -497.0266367 hartree
pointgroup: C01 [X(C7H20N4)]
dipole: -0.0000546 -0.2505195 -0.0617123 debye
polarizability: 146.0110403|0.0037096|93.0676167|-0.0449074|-4.654956|83.7344558 unknown
InChI: InChI=1S/C7H20N4/c8-2-6-10-4-1-5-11-7-3-9/h10-11H,1-9H2
charge 0 multiplicity 1
31 atoms
N  -2.48985 -0.333449 0.036386
N  2.487727 -0.333053 0.033407
N  -6.239536 0.166786 -0.083313
N  6.236988 0.168237 -0.09269
C  -0.001067 -0.330219 0.028186
C  -1.284141 0.523249 0.032969
C  1.281877 0.523485 0.031702
C  -3.774021 0.400391 0.035886
C  3.771744 0.401002 0.031065
C  -4.96283 -0.575662 -0.075931
C  4.960672 -0.57481 -0.081095
H  -0.000552 -0.991485 0.923007
H  -0.001394 -0.990207 -0.85767
H  -1.254401 1.233176 0.900394
H  -1.313355 1.147459 -0.8830
H  1.309943 1.147941 -0.884123
H  1.253092 1.233107 0.89938
H  -2.452652 -1.016414 0.807762
H  2.451687 -1.016036 0.804816
H  -3.775758 1.077264 -0.843631
H  -3.929891 1.042835 0.935969
H  3.928223 1.044355 0.93041
H  3.772604 1.07715 -0.849029
H  -4.964705 -1.242162 0.809979
H  -4.793517 -1.222754 -0.967779
H  4.789725 -1.223803 -0.971272
H  4.964782 -1.23948 0.806186
H  -7.067728 -0.404999 0.103124
H  -6.366555 0.767538 -0.903765
H  6.361934 0.767396 -0.914623
H  7.065858 -0.402737 0.093193
