program: Gaussian 09
title: 000078477
version: EM64L-G09RevD.01
frameworkgroup: C1[X(C8H12NO2P)]
method: RPBEPBE
basis: SDD
operation: Freq
keyword: #p
keyword: freq=noraman
keyword: PBEPBE/SDD
title: #p freq=noraman PBEPBE/SDD
converged: YES YES NO NO
title: Mulliken charges:
elementType: P O O N C C C C C C C C H H H H H H H H H H H H
charge: 0.819512 -0.688314 -0.689642 -0.154815 0.413752 -0.340181 -0.340166 -0.307261 -0.237423 -0.238087 -0.646570 -0.646553 0.235788 0.235801 0.257347 0.254161 0.234007 0.215453 0.235685 0.235364 0.215486 0.234219 0.350899 0.351539
chargesum: 0.00000
title: Mulliken charges with hydrogens summed into heavy atoms:
elementType: P O O N C C C C C C C C
charge: 0.819512 -0.337416 -0.338102 -0.154815 0.413752 -0.104393 -0.104364 -0.307261 0.019924 0.016073 0.038575 0.038515
polarizability: 2.11743062e+02 1.22057646e-01 1.24684215e+02 3.28229903e+00 -3.61780172e-02 6.71294942e+01
1716.lowfreq: -14.5075 -14.0839 -2.6027 -0.0025 -0.0020 -0.0019 23.8953 64.0689 77.5755
frequency: 22.9829 64.0680 77.4818 99.1214 126.2942 163.7498 193.7195 216.9094 218.7786 273.0253 305.2614 307.0819 388.0030 395.0121 413.8358 428.8201 460.9539 475.8340 523.4298 598.7068 624.5182 638.5913 657.2897 722.6378 750.3668 804.3406 815.4156 937.1287 942.7781 953.7310 990.1220 1004.0840 1028.1141 1056.1972 1102.3941 1108.4403 1109.8945 1130.2851 1164.8995 1206.3895 1261.1435 1307.8077 1359.0027 1371.0558 1421.5442 1437.0841 1456.6346 1463.6661 1474.7050 1491.3068 1500.1588 1517.4882 1553.1131 1619.8059 2937.8505 2946.0671 3003.4105 3005.9976 3093.6585 3104.0632 3142.4523 3144.0247 3165.2490 3169.5104 3575.3194 3579.1189
redmass: 4.7931 4.3713 2.3124 1.5915 5.0575 2.7231 1.1248 4.0540 4.2226 5.1773 2.6379 3.3391 1.5767 4.1823 2.8542 1.1835 3.2665 3.4904 2.4651 4.4659 7.7649 13.3173 14.3465 3.2779 5.5822 1.2543 1.8607 1.6863 2.0838 1.3504 3.6416 1.0906 1.1689 1.4913 3.1204 1.2403 1.3191 1.4550 1.6437 1.1378 2.9054 1.4030 2.9319 4.7116 2.1228 1.5179 1.2239 1.0400 1.0461 1.0804 1.3347 1.7868 6.6727 5.9561 1.0368 1.0395 1.0991 1.1030 1.0962 1.0940 1.0874 1.0872 1.0945 1.0957 1.0663 1.0664
irintensity: 0.1601 7.4117 0.0229 1.7101 2.6182 5.2957 0.0076 5.8082 0.2598 2.0655 16.4663 22.3456 36.9586 25.2289 1.0439 129.9407 15.7197 10.9722 25.1943 4.8131 21.6568 118.9467 118.1678 0.0100 3.1332 0.3109 91.6437 11.5934 6.9180 0.0323 2.3978 105.0437 63.8439 26.0480 84.2267 0.0291 1.4738 1.3248 3.0335 29.0232 29.6745 11.4502 126.3523 2.1398 3.2869 1.2388 18.0359 0.0403 21.1428 2.0815 1.6226 211.1894 8.0497 318.3622 109.6410 95.0517 0.0616 92.5792 4.3338 47.7318 1.9920 3.7927 24.5362 12.4623 24.3753 11.8731
temp: 298.150 k
press: 1.00000 atm
elementType: 15 8 8 7 6 6 6 6 6 6 6 6 1 1 1 1 1 1 1 1 1 1 1 1
symmnumber: 1
zpe: 494069.2 jmol-1
zpe.correction: 0.188181 hartree
zpe.thermalcorrener: 0.201793 hartree
zpe.thermalcorrenthalpy: 0.202737 hartree
zpe.thermalcorrgfe: 0.147240 hartree
zpe.sumelectzpe: -857.560349 hartree
zpe.sumelectthermal: -857.546737 hartree
zpe.sumelectthermalent: -857.545792 hartree
zpe.sumelectthermalfe: -857.601290 hartree
dipole: 1.9479 -0.0172 -1.3455
dipole: 2.3675
quadrupole: -47.4123 -71.4761 -86.5865
quadrupole: 0.0406 4.4654 0.0195
quadrupole: 21.0793 -2.9845 -18.0948 0.0406 4.4654 0.0195
hfenergy: -857.7485298 hartree
pointgroup: C01 [X(C8H12N1O2P1)]
dipole: -0.7682417 -0.0340349 0.5255813 debye
dipolederiv: 1.1942522 0.0016789 -0.024464 0.0098429 1.0671707 0.0210623 -0.2400779 0.0180832 0.7518519 -0.3938735 0.0568814 0.1300039 0.4028952 -0.8380187 -0.126897 0.4354888 -0.3781365 -0.6739699 -0.3870803 -0.0635338 0.1215532 -0.4366178 -0.9031438 0.1017076 0.380385 0.3589603 -0.6216861 -1.8722954 -0.0088137 -0.0846706 -0.0079979 -0.5235513 -0.0086493 -0.0994764 -0.0062853 -0.2981481 1.8280784 0.0128067 0.0960274 0.0124014 -0.0623288 -0.005143 0.1152473 -0.005304 0.1487307 -0.5988004 0.0153841 -0.0008542 -0.4406202 0.006089 -0.0166011 -0.0113808 0.0080382 -0.2440046 -0.6047237 -0.0261137 -0.0020188 0.4299806 0.0103604 0.0334195 0.0149078 0.0085565 -0.2420819 -0.7730196 -0.0020837 -0.019341 0.0084795 -0.3277289 -0.0032351 -0.2418602 -0.0050272 -0.2209793 0.3492726 -0.089734 0.00909 -0.2645403 0.1451979 0.0145496 -0.0311554 -0.0558826 -0.0987362 0.346632 0.0908909 0.0150573 0.2678932 0.151419 0.0014241 -0.0157042 0.0716095 -0.0950227 0.3234208 -0.1631242 -0.0045038 -0.4786403 0.4655944 -0.0212311 -0.0171863 -0.0091806 0.2572355 0.3132903 0.1609052 0.0053339 0.4765358 0.4733282 0.0364794 0.0116379 0.0243494 0.2601794 0.0008087 0.0941491 -0.0069462 0.1006462 -0.0550992 0.0015603 -0.001891 0.0035345 0.1668011 0.0043524 -0.0926017 -0.0128976 -0.0992388 -0.0570132 -0.0162787 -0.0085938 -0.0186401 0.1655001 0.0886741 -0.0778448 -0.0162585 -0.0560389 -0.0138745 -0.0090324 -0.0218464 -0.0009977 0.1424128 0.0813122 0.0830499 -0.0112007 0.060981 -0.0146209 -0.0013091 -0.0159615 -0.0091928 0.1417501 0.0973035 -0.0405966 -0.0552208 0.137013 -0.0748374 -0.0893337 0.0450482 -0.1322796 -0.1008303 -0.1822635 -0.0058378 -0.0200106 -0.101162 0.0879086 -0.0073644 -0.024956 -0.000369 0.1140567 0.084192 -0.0618191 0.0776835 0.1277344 -0.0854383 0.1030235 -0.0122096 0.1253013 -0.0809788 0.0849294 0.0575235 0.081295 -0.1267111 -0.0731322 -0.1016226 -0.0200333 -0.1265812 -0.097059 -0.1843136 0.0026895 -0.0173247 0.0981684 0.0893012 0.0040011 -0.016863 -0.0027186 0.1146412 0.0995278 0.0489542 -0.0557285 -0.1340811 -0.0895245 0.0890633 0.0325384 0.1324719 -0.0858104 0.0472772 0.037106 -0.1008012 0.0314577 0.310391 -0.0069137 -0.1263639 0.0165349 0.2974221 0.0530466 -0.0299164 -0.1038031 -0.0183809 0.3115514 0.0073205 -0.1296936 -0.0168447 0.2987257 unknown
polarizability: 211.710361|0.6012801|124.6049925|3.8463571|2.2164117|67.2414185 unknown
InChI: InChI=1S/C8H12NO2P/c1-9(2)7-3-5-8(6-4-7)12(10)11/h3-6,10-11H,1-2H3
charge 0 multiplicity 1
24 atoms
P  3.241915 -0.017264 0.470193
O  3.540589 -1.378437 -0.650936
O  3.512384 1.465216 -0.49233
N  -2.853263 -0.045689 -0.089768
C  -1.45941 -0.037634 0.014399
C  -0.728987 1.191774 0.105994
C  -0.708924 -1.258358 0.026527
C  1.403625 -0.021338 0.23958
C  0.67201 1.191935 0.217896
C  0.691863 -1.242556 0.139082
C  -3.596359 1.220043 -0.11832
C  -3.576499 -1.319072 -0.192082
H  -1.254093 2.150675 0.081264
H  -1.21785 -2.222158 -0.061532
H  1.210332 2.144656 0.255547
H  1.244544 -2.187634 0.114225
H  -3.436005 1.812201 0.805803
H  -4.674434 1.01064 -0.202497
H  -3.303504 1.851843 -0.981908
H  -3.283189 -1.890844 -1.096552
H  -4.658533 -1.122367 -0.252771
H  -3.397193 -1.965244 0.691341
H  4.440056 -1.771926 -0.512436
H  4.405226 1.856937 -0.313419
